Series without cover letter

Submitted by Tvrtko Ursulin on Aug. 24, 2018, 10:40 a.m.

Details

Reviewer None
Submitted Aug. 24, 2018, 10:40 a.m.
Last Updated Aug. 28, 2018, 11:18 p.m.
Revision 5

Revisions

Patches download mbox

Tests

= CI Bug Log - changes from CI_DRM_4703 -> Trybot_2820 =

== Summary - SUCCESS ==

  No regressions found.

  External URL: https://patchwork.freedesktop.org/api/1.0/series/48662/revisions/1/mbox/

== Known issues ==

  Here are the changes found in Trybot_2820 that come from known issues:

  === IGT changes ===

    ==== Issues hit ====

    igt@kms_frontbuffer_tracking@basic:
      {fi-byt-clapper}:   PASS -> FAIL (fdo#103167)

    {igt@kms_psr@primary_page_flip}:
      {fi-icl-u}:         NOTRUN -> FAIL (fdo#107383) +3

    igt@prime_vgem@basic-fence-flip:
      fi-ilk-650:         PASS -> FAIL (fdo#104008)

    
    ==== Possible fixes ====

    igt@drv_selftest@live_hangcheck:
      {fi-bdw-samus}:     DMESG-FAIL (fdo#106560) -> PASS
      fi-skl-guc:         DMESG-FAIL (fdo#107174) -> PASS

    igt@gem_sync@basic-many-each:
      {fi-byt-clapper}:   FAIL -> PASS

    
  {name}: This element is suppressed. This means it is ignored when computing
          the status of the difference (SUCCESS, WARNING, or FAILURE).

  fdo#103167 https://bugs.freedesktop.org/show_bug.cgi?id=103167
  fdo#104008 https://bugs.freedesktop.org/show_bug.cgi?id=104008
  fdo#106560 https://bugs.freedesktop.org/show_bug.cgi?id=106560
  fdo#107174 https://bugs.freedesktop.org/show_bug.cgi?id=107174
  fdo#107383 https://bugs.freedesktop.org/show_bug.cgi?id=107383


== Participating hosts (53 -> 49) ==

  Additional (1): fi-icl-u 
  Missing    (5): fi-ctg-p8600 fi-ilk-m540 fi-byt-squawks fi-bsw-cyan fi-hsw-4200u 


== Build changes ==

    * Linux: CI_DRM_4703 -> Trybot_2820

  CI_DRM_4703: 5dedf9d9259854872430c04a29737924731ba6f1 @ git://anongit.freedesktop.org/gfx-ci/linux
  IGT_4609: 0bc9763af77bbb37f2ed65cc39c398e88db7d8e3 @ git://anongit.freedesktop.org/xorg/app/intel-gpu-tools
  Trybot_2820: 1fff960cb5b9ae26f446dbdb107e065fe200569e @ git://anongit.freedesktop.org/gfx-ci/linux


== Kernel 32bit build ==

Warning: Kernel 32bit buildtest failed:
https://intel-gfx-ci.01.org/tree/drm-tip/Trybot_2820/build_32bit.log

  CALL    scripts/checksyscalls.sh
  CHK     include/generated/compile.h
  CC [M]  drivers/gpu/drm/i915/i915_gem_context.o
In file included from ./include/linux/printk.h:7:0,
                 from ./include/linux/kernel.h:14,
                 from ./include/linux/list.h:9,
                 from ./include/linux/agp_backend.h:33,
                 from ./include/drm/drmP.h:35,
                 from drivers/gpu/drm/i915/i915_gem_context.c:89:
drivers/gpu/drm/i915/selftests/i915_gem_context.c: In function ‘igt_ctx_sseu’:
./include/linux/kern_levels.h:5:18: error: format ‘%lu’ expects argument of type ‘long unsigned int’, but argument 4 has type ‘unsigned int’ [-Werror=format=]
 #define KERN_SOH "\001"  /* ASCII Start Of Header */
                  ^
./include/linux/kern_levels.h:14:19: note: in expansion of macro ‘KERN_SOH’
 #define KERN_INFO KERN_SOH "6" /* informational */
                   ^~~~~~~~
./include/linux/printk.h:311:9: note: in expansion of macro ‘KERN_INFO’
  printk(KERN_INFO pr_fmt(fmt), ##__VA_ARGS__)
         ^~~~~~~~~
drivers/gpu/drm/i915/selftests/i915_gem_context.c:657:3: note: in expansion of macro ‘pr_info’
   pr_info("%u:    Submitted %lu queries across %lu contexts\n",
   ^~~~~~~
In file included from drivers/gpu/drm/i915/i915_gem_context.c:1213:0:
drivers/gpu/drm/i915/selftests/i915_gem_context.c:657:50: note: format string is defined here
   pr_info("%u:    Submitted %lu queries across %lu contexts\n",
                                                ~~^
                                                %u
cc1: all warnings being treated as errors
scripts/Makefile.build:317: recipe for target 'drivers/gpu/drm/i915/i915_gem_context.o' failed
make[4]: *** [drivers/gpu/drm/i915/i915_gem_context.o] Error 1
scripts/Makefile.build:558: recipe for target 'drivers/gpu/drm/i915' failed
make[3]: *** [drivers/gpu/drm/i915] Error 2
scripts/Makefile.build:558: recipe for target 'drivers/gpu/drm' failed
make[2]: *** [drivers/gpu/drm] Error 2
scripts/Makefile.build:558: recipe for target 'drivers/gpu' failed
make[1]: *** [drivers/gpu] Error 2
Makefile:1029: recipe for target 'drivers' failed
make: *** [drivers] Error 2


== Linux commits ==

1fff960cb5b9 sseu test
7e940c51bc05 drm/i915: Expose RPCS (SSEU) configuration to userspace
597c996da07c drm/i915: Explicitly mark Global GTT address spaces
72363a6f137c drm/i915: Add timeline barrier support
073f6ee4f56f drm/i915/perf: lock powergating configuration to default when active
784a84e79fe3 drm/i915/perf: reuse intel_lrc ctx regs macro
58e93e960108 drm/i915/perf: simplify configure all context function
0c7459d554d0 drm/i915: Record the sseu configuration per-context & engine
a9eca9d29fba drm/i915: Program RPCS for Broadwell
3b3976112da3 drm/i915/icl: Fix context slice count configuration
79cad26d04b9 drm/i915: Fix subslice configuration on Gen9LP
= CI Bug Log - changes from CI_DRM_4703_full -> Trybot_2820_full =

== Summary - FAILURE ==

  Serious unknown changes coming with Trybot_2820_full absolutely need to be
  verified manually.
  
  If you think the reported changes have nothing to do with the changes
  introduced in Trybot_2820_full, please notify your bug team to allow them
  to document this new failure mode, which will reduce false positives in CI.

  

== Possible new issues ==

  Here are the unknown changes that may have been introduced in Trybot_2820_full:

  === IGT changes ===

    ==== Possible regressions ====

    igt@gem_ctx_param@invalid-param-get:
      shard-apl:          PASS -> FAIL
      shard-glk:          PASS -> FAIL
      shard-kbl:          PASS -> FAIL

    igt@gem_ctx_param@invalid-param-set:
      shard-kbl:          PASS -> DMESG-FAIL
      shard-hsw:          PASS -> FAIL +1
      shard-snb:          PASS -> FAIL +1
      shard-glk:          PASS -> DMESG-FAIL
      shard-apl:          PASS -> DMESG-FAIL

    
== Known issues ==

  Here are the changes found in Trybot_2820_full that come from known issues:

  === IGT changes ===

    ==== Issues hit ====

    igt@kms_cursor_legacy@cursor-vs-flip-toggle:
      shard-hsw:          PASS -> FAIL (fdo#103355)

    igt@kms_setmode@basic:
      shard-apl:          PASS -> FAIL (fdo#99912)

    
  fdo#103355 https://bugs.freedesktop.org/show_bug.cgi?id=103355
  fdo#99912 https://bugs.freedesktop.org/show_bug.cgi?id=99912


== Participating hosts (5 -> 5) ==

  No changes in participating hosts


== Build changes ==

    * Linux: CI_DRM_4703 -> Trybot_2820

  CI_DRM_4703: 5dedf9d9259854872430c04a29737924731ba6f1 @ git://anongit.freedesktop.org/gfx-ci/linux
  IGT_4609: 0bc9763af77bbb37f2ed65cc39c398e88db7d8e3 @ git://anongit.freedesktop.org/xorg/app/intel-gpu-tools
  Trybot_2820: 1fff960cb5b9ae26f446dbdb107e065fe200569e @ git://anongit.freedesktop.org/gfx-ci/linux
  piglit_4509: fdc5a4ca11124ab8413c7988896eec4c97336694 @ git://anongit.freedesktop.org/piglit

Patches download mbox

Tests

= CI Bug Log - changes from CI_DRM_4714 -> Trybot_2826 =

== Summary - FAILURE ==

  Serious unknown changes coming with Trybot_2826 absolutely need to be
  verified manually.
  
  If you think the reported changes have nothing to do with the changes
  introduced in Trybot_2826, please notify your bug team to allow them
  to document this new failure mode, which will reduce false positives in CI.

  External URL: https://patchwork.freedesktop.org/api/1.0/series/48662/revisions/2/mbox/

== Possible new issues ==

  Here are the unknown changes that may have been introduced in Trybot_2826:

  === IGT changes ===

    ==== Possible regressions ====

    igt@gem_exec_suspend@basic-s3:
      fi-blb-e6850:       PASS -> INCOMPLETE

    
== Known issues ==

  Here are the changes found in Trybot_2826 that come from known issues:

  === IGT changes ===

    ==== Issues hit ====

    igt@drv_selftest@live_guc:
      fi-skl-guc:         NOTRUN -> DMESG-WARN (fdo#107175, fdo#107258)

    igt@kms_pipe_crc_basic@suspend-read-crc-pipe-a:
      {fi-byt-clapper}:   PASS -> FAIL (fdo#103191, fdo#107362) +1

    
    ==== Possible fixes ====

    {igt@amdgpu/amd_prime@i915-to-amd}:
      fi-bxt-j4205:       INCOMPLETE (fdo#103927) -> SKIP

    igt@drv_selftest@live_hangcheck:
      fi-kbl-7567u:       DMESG-FAIL (fdo#106947, fdo#106560) -> PASS

    igt@kms_chamelium@dp-edid-read:
      fi-kbl-7500u:       FAIL (fdo#103841) -> PASS

    {igt@pm_rpm@module-reload}:
      fi-bxt-j4205:       DMESG-FAIL -> PASS

    igt@prime_vgem@basic-fence-flip:
      fi-ilk-650:         FAIL (fdo#104008) -> PASS

    
  {name}: This element is suppressed. This means it is ignored when computing
          the status of the difference (SUCCESS, WARNING, or FAILURE).

  fdo#103191 https://bugs.freedesktop.org/show_bug.cgi?id=103191
  fdo#103841 https://bugs.freedesktop.org/show_bug.cgi?id=103841
  fdo#103927 https://bugs.freedesktop.org/show_bug.cgi?id=103927
  fdo#104008 https://bugs.freedesktop.org/show_bug.cgi?id=104008
  fdo#106560 https://bugs.freedesktop.org/show_bug.cgi?id=106560
  fdo#106947 https://bugs.freedesktop.org/show_bug.cgi?id=106947
  fdo#107175 https://bugs.freedesktop.org/show_bug.cgi?id=107175
  fdo#107258 https://bugs.freedesktop.org/show_bug.cgi?id=107258
  fdo#107362 https://bugs.freedesktop.org/show_bug.cgi?id=107362


== Participating hosts (53 -> 49) ==

  Additional (1): fi-skl-guc 
  Missing    (5): fi-ctg-p8600 fi-ilk-m540 fi-byt-squawks fi-bsw-cyan fi-hsw-4200u 


== Build changes ==

    * Linux: CI_DRM_4714 -> Trybot_2826

  CI_DRM_4714: 06fa287b780cfea38a1c599cc1fc3611262668cf @ git://anongit.freedesktop.org/gfx-ci/linux
  IGT_4610: c40743d3fce5055682d31610519758dd7379c0f8 @ git://anongit.freedesktop.org/xorg/app/intel-gpu-tools
  Trybot_2826: 55a7a027e1981485f2958eb58d2aa773615a04e3 @ git://anongit.freedesktop.org/gfx-ci/linux


== Kernel 32bit build ==

Warning: Kernel 32bit buildtest failed:
https://intel-gfx-ci.01.org/tree/drm-tip/Trybot_2826/build_32bit.log

  CALL    scripts/checksyscalls.sh
  CHK     include/generated/compile.h
  CC [M]  drivers/gpu/drm/i915/i915_gem_context.o
In file included from ./include/linux/printk.h:7:0,
                 from ./include/linux/kernel.h:14,
                 from ./include/linux/list.h:9,
                 from ./include/linux/agp_backend.h:33,
                 from ./include/drm/drmP.h:35,
                 from drivers/gpu/drm/i915/i915_gem_context.c:89:
drivers/gpu/drm/i915/selftests/i915_gem_context.c: In function ‘igt_ctx_sseu’:
./include/linux/kern_levels.h:5:18: error: format ‘%lu’ expects argument of type ‘long unsigned int’, but argument 4 has type ‘unsigned int’ [-Werror=format=]
 #define KERN_SOH "\001"  /* ASCII Start Of Header */
                  ^
./include/linux/kern_levels.h:14:19: note: in expansion of macro ‘KERN_SOH’
 #define KERN_INFO KERN_SOH "6" /* informational */
                   ^~~~~~~~
./include/linux/printk.h:315:9: note: in expansion of macro ‘KERN_INFO’
  printk(KERN_INFO pr_fmt(fmt), ##__VA_ARGS__)
         ^~~~~~~~~
drivers/gpu/drm/i915/selftests/i915_gem_context.c:663:3: note: in expansion of macro ‘pr_info’
   pr_info("%u:    Submitted %lu queries across %lu contexts\n",
   ^~~~~~~
In file included from drivers/gpu/drm/i915/i915_gem_context.c:1213:0:
drivers/gpu/drm/i915/selftests/i915_gem_context.c:663:50: note: format string is defined here
   pr_info("%u:    Submitted %lu queries across %lu contexts\n",
                                                ~~^
                                                %u
cc1: all warnings being treated as errors
scripts/Makefile.build:307: recipe for target 'drivers/gpu/drm/i915/i915_gem_context.o' failed
make[4]: *** [drivers/gpu/drm/i915/i915_gem_context.o] Error 1
scripts/Makefile.build:548: recipe for target 'drivers/gpu/drm/i915' failed
make[3]: *** [drivers/gpu/drm/i915] Error 2
scripts/Makefile.build:548: recipe for target 'drivers/gpu/drm' failed
make[2]: *** [drivers/gpu/drm] Error 2
scripts/Makefile.build:548: recipe for target 'drivers/gpu' failed
make[1]: *** [drivers/gpu] Error 2
Makefile:1057: recipe for target 'drivers' failed
make: *** [drivers] Error 2


== Linux commits ==

55a7a027e198 sseu test
aea4aef20516 drm/i915: Expose RPCS (SSEU) configuration to userspace
16076865a64a drm/i915: Explicitly mark Global GTT address spaces
2057184c2672 drm/i915: Add timeline barrier support
289fa2b7e218 drm/i915/perf: lock powergating configuration to default when active
d85955075ba5 drm/i915/perf: reuse intel_lrc ctx regs macro
7e5d9a4a959f drm/i915/perf: simplify configure all context function
9b0533c8c566 drm/i915: Record the sseu configuration per-context & engine
0976f8172dde drm/i915: Program RPCS for Broadwell
784f203a0764 drm/i915/icl: Fix context slice count configuration
08050b41dffb drm/i915: Fix subslice configuration on Gen9LP

Patches download mbox

Tests

= CI Bug Log - changes from CI_DRM_4714 -> Trybot_2829 =

== Summary - FAILURE ==

  Serious unknown changes coming with Trybot_2829 absolutely need to be
  verified manually.
  
  If you think the reported changes have nothing to do with the changes
  introduced in Trybot_2829, please notify your bug team to allow them
  to document this new failure mode, which will reduce false positives in CI.

  External URL: https://patchwork.freedesktop.org/api/1.0/series/48662/revisions/3/mbox/

== Possible new issues ==

  Here are the unknown changes that may have been introduced in Trybot_2829:

  === IGT changes ===

    ==== Possible regressions ====

    igt@gem_exec_suspend@basic-s4-devices:
      fi-blb-e6850:       PASS -> INCOMPLETE

    
== Known issues ==

  Here are the changes found in Trybot_2829 that come from known issues:

  === IGT changes ===

    ==== Issues hit ====

    igt@drv_selftest@live_guc:
      fi-skl-guc:         NOTRUN -> DMESG-WARN (fdo#107175, fdo#107258)

    igt@kms_flip@basic-flip-vs-modeset:
      fi-hsw-4770r:       PASS -> DMESG-WARN (fdo#105602)

    igt@kms_pipe_crc_basic@read-crc-pipe-b:
      {fi-byt-clapper}:   PASS -> FAIL (fdo#107362)

    igt@kms_pipe_crc_basic@suspend-read-crc-pipe-a:
      {fi-byt-clapper}:   PASS -> FAIL (fdo#103191, fdo#107362)

    
    ==== Possible fixes ====

    {igt@amdgpu/amd_prime@i915-to-amd}:
      fi-bxt-j4205:       INCOMPLETE (fdo#103927) -> SKIP

    igt@drv_selftest@live_hangcheck:
      fi-kbl-7567u:       DMESG-FAIL (fdo#106947, fdo#106560) -> PASS

    igt@kms_chamelium@dp-edid-read:
      fi-kbl-7500u:       FAIL (fdo#103841) -> PASS

    {igt@pm_rpm@module-reload}:
      fi-bxt-j4205:       DMESG-FAIL (fdo#107712) -> PASS

    igt@prime_vgem@basic-fence-flip:
      fi-ilk-650:         FAIL (fdo#104008) -> PASS

    
  {name}: This element is suppressed. This means it is ignored when computing
          the status of the difference (SUCCESS, WARNING, or FAILURE).

  fdo#103191 https://bugs.freedesktop.org/show_bug.cgi?id=103191
  fdo#103841 https://bugs.freedesktop.org/show_bug.cgi?id=103841
  fdo#103927 https://bugs.freedesktop.org/show_bug.cgi?id=103927
  fdo#104008 https://bugs.freedesktop.org/show_bug.cgi?id=104008
  fdo#105602 https://bugs.freedesktop.org/show_bug.cgi?id=105602
  fdo#106560 https://bugs.freedesktop.org/show_bug.cgi?id=106560
  fdo#106947 https://bugs.freedesktop.org/show_bug.cgi?id=106947
  fdo#107175 https://bugs.freedesktop.org/show_bug.cgi?id=107175
  fdo#107258 https://bugs.freedesktop.org/show_bug.cgi?id=107258
  fdo#107362 https://bugs.freedesktop.org/show_bug.cgi?id=107362
  fdo#107712 https://bugs.freedesktop.org/show_bug.cgi?id=107712


== Participating hosts (53 -> 49) ==

  Additional (1): fi-skl-guc 
  Missing    (5): fi-ctg-p8600 fi-ilk-m540 fi-byt-squawks fi-bsw-cyan fi-hsw-4200u 


== Build changes ==

    * Linux: CI_DRM_4714 -> Trybot_2829

  CI_DRM_4714: 06fa287b780cfea38a1c599cc1fc3611262668cf @ git://anongit.freedesktop.org/gfx-ci/linux
  IGT_4610: c40743d3fce5055682d31610519758dd7379c0f8 @ git://anongit.freedesktop.org/xorg/app/intel-gpu-tools
  Trybot_2829: 901c279764674e3797dd908f8e1d5e512064e721 @ git://anongit.freedesktop.org/gfx-ci/linux


== Kernel 32bit build ==

Warning: Kernel 32bit buildtest failed:
https://intel-gfx-ci.01.org/tree/drm-tip/Trybot_2829/build_32bit.log

  CALL    scripts/checksyscalls.sh
  CHK     include/generated/compile.h
  CC [M]  drivers/gpu/drm/i915/i915_gem_context.o
In file included from ./include/linux/printk.h:7:0,
                 from ./include/linux/kernel.h:14,
                 from ./include/linux/list.h:9,
                 from ./include/linux/agp_backend.h:33,
                 from ./include/drm/drmP.h:35,
                 from drivers/gpu/drm/i915/i915_gem_context.c:89:
drivers/gpu/drm/i915/selftests/i915_gem_context.c: In function ‘igt_ctx_sseu’:
./include/linux/kern_levels.h:5:18: error: format ‘%lu’ expects argument of type ‘long unsigned int’, but argument 4 has type ‘unsigned int’ [-Werror=format=]
 #define KERN_SOH "\001"  /* ASCII Start Of Header */
                  ^
./include/linux/kern_levels.h:14:19: note: in expansion of macro ‘KERN_SOH’
 #define KERN_INFO KERN_SOH "6" /* informational */
                   ^~~~~~~~
./include/linux/printk.h:315:9: note: in expansion of macro ‘KERN_INFO’
  printk(KERN_INFO pr_fmt(fmt), ##__VA_ARGS__)
         ^~~~~~~~~
drivers/gpu/drm/i915/selftests/i915_gem_context.c:675:3: note: in expansion of macro ‘pr_info’
   pr_info("%u:    Submitted %lu queries across %lu contexts\n",
   ^~~~~~~
In file included from drivers/gpu/drm/i915/i915_gem_context.c:1213:0:
drivers/gpu/drm/i915/selftests/i915_gem_context.c:675:50: note: format string is defined here
   pr_info("%u:    Submitted %lu queries across %lu contexts\n",
                                                ~~^
                                                %u
cc1: all warnings being treated as errors
scripts/Makefile.build:307: recipe for target 'drivers/gpu/drm/i915/i915_gem_context.o' failed
make[4]: *** [drivers/gpu/drm/i915/i915_gem_context.o] Error 1
scripts/Makefile.build:548: recipe for target 'drivers/gpu/drm/i915' failed
make[3]: *** [drivers/gpu/drm/i915] Error 2
scripts/Makefile.build:548: recipe for target 'drivers/gpu/drm' failed
make[2]: *** [drivers/gpu/drm] Error 2
scripts/Makefile.build:548: recipe for target 'drivers/gpu' failed
make[1]: *** [drivers/gpu] Error 2
Makefile:1057: recipe for target 'drivers' failed
make: *** [drivers] Error 2


== Linux commits ==

901c27976467 sseu test
c9528ad528df drm/i915: Expose RPCS (SSEU) configuration to userspace
b980c5c7cad1 drm/i915: Explicitly mark Global GTT address spaces
02873583191e drm/i915: Add timeline barrier support
72b8e5b30fa9 drm/i915/perf: lock powergating configuration to default when active
3a08ead85797 drm/i915/perf: reuse intel_lrc ctx regs macro
a71084944249 drm/i915/perf: simplify configure all context function
e3845166d2c6 drm/i915: Record the sseu configuration per-context & engine
140bbeec7f39 drm/i915: Program RPCS for Broadwell
2e9f91b625e2 drm/i915/icl: Fix context slice count configuration
69acabf1fd7d drm/i915: Fix subslice configuration on Gen9LP
= CI Bug Log - changes from CI_DRM_4714_full -> Trybot_2828_full =

== Summary - FAILURE ==

  Serious unknown changes coming with Trybot_2828_full absolutely need to be
  verified manually.
  
  If you think the reported changes have nothing to do with the changes
  introduced in Trybot_2828_full, please notify your bug team to allow them
  to document this new failure mode, which will reduce false positives in CI.

  

== Possible new issues ==

  Here are the unknown changes that may have been introduced in Trybot_2828_full:

  === IGT changes ===

    ==== Possible regressions ====

    igt@gem_ctx_param@invalid-param-get:
      shard-apl:          PASS -> FAIL
      shard-glk:          PASS -> FAIL
      shard-kbl:          PASS -> FAIL

    igt@gem_ctx_param@invalid-param-set:
      shard-kbl:          PASS -> DMESG-FAIL
      shard-hsw:          PASS -> FAIL +1
      shard-snb:          PASS -> FAIL +1
      shard-glk:          PASS -> DMESG-FAIL
      shard-apl:          PASS -> DMESG-FAIL

    
== Known issues ==

  Here are the changes found in Trybot_2828_full that come from known issues:

  === IGT changes ===

    ==== Issues hit ====

    igt@drv_suspend@shrink:
      shard-apl:          PASS -> FAIL (fdo#106886)

    igt@gem_ppgtt@blt-vs-render-ctx0:
      shard-kbl:          PASS -> INCOMPLETE (fdo#106023, fdo#103665)

    igt@gem_workarounds@suspend-resume-fd:
      shard-glk:          PASS -> INCOMPLETE (fdo#103359, k.org#198133) +1

    igt@kms_flip@2x-flip-vs-expired-vblank-interruptible:
      shard-glk:          PASS -> FAIL (fdo#105363)

    
    ==== Possible fixes ====

    igt@perf@blocking:
      shard-hsw:          FAIL (fdo#102252) -> PASS

    
  fdo#102252 https://bugs.freedesktop.org/show_bug.cgi?id=102252
  fdo#103359 https://bugs.freedesktop.org/show_bug.cgi?id=103359
  fdo#103665 https://bugs.freedesktop.org/show_bug.cgi?id=103665
  fdo#105363 https://bugs.freedesktop.org/show_bug.cgi?id=105363
  fdo#106023 https://bugs.freedesktop.org/show_bug.cgi?id=106023
  fdo#106886 https://bugs.freedesktop.org/show_bug.cgi?id=106886
  k.org#198133 https://bugzilla.kernel.org/show_bug.cgi?id=198133


== Participating hosts (5 -> 5) ==

  No changes in participating hosts


== Build changes ==

    * Linux: CI_DRM_4714 -> Trybot_2828

  CI_DRM_4714: 06fa287b780cfea38a1c599cc1fc3611262668cf @ git://anongit.freedesktop.org/gfx-ci/linux
  IGT_4610: c40743d3fce5055682d31610519758dd7379c0f8 @ git://anongit.freedesktop.org/xorg/app/intel-gpu-tools
  Trybot_2828: 2ca859c31063dad27a094079eec8da9ddaebb269 @ git://anongit.freedesktop.org/gfx-ci/linux
  piglit_4509: fdc5a4ca11124ab8413c7988896eec4c97336694 @ git://anongit.freedesktop.org/piglit

Patches download mbox

Tests

= CI Bug Log - changes from CI_DRM_4715 -> Trybot_2830 =

== Summary - FAILURE ==

  Serious unknown changes coming with Trybot_2830 absolutely need to be
  verified manually.
  
  If you think the reported changes have nothing to do with the changes
  introduced in Trybot_2830, please notify your bug team to allow them
  to document this new failure mode, which will reduce false positives in CI.

  External URL: https://patchwork.freedesktop.org/api/1.0/series/48662/revisions/4/mbox/

== Possible new issues ==

  Here are the unknown changes that may have been introduced in Trybot_2830:

  === IGT changes ===

    ==== Possible regressions ====

    igt@gem_mmap_gtt@basic-small-bo-tiledx:
      fi-ilk-650:         PASS -> INCOMPLETE

    
== Known issues ==

  Here are the changes found in Trybot_2830 that come from known issues:

  === IGT changes ===

    ==== Issues hit ====

    igt@kms_chamelium@dp-edid-read:
      fi-kbl-7500u:       PASS -> FAIL (fdo#103841)

    igt@kms_pipe_crc_basic@suspend-read-crc-pipe-b:
      fi-snb-2520m:       NOTRUN -> INCOMPLETE (fdo#103713)

    igt@kms_pipe_crc_basic@suspend-read-crc-pipe-c:
      fi-bxt-dsi:         NOTRUN -> INCOMPLETE (fdo#103927)

    
    ==== Possible fixes ====

    igt@debugfs_test@read_all_entries:
      fi-snb-2520m:       INCOMPLETE (fdo#103713) -> PASS

    
    ==== Warnings ====

    {igt@pm_rpm@module-reload}:
      fi-bsw-n3050:       DMESG-WARN (fdo#107704) -> DMESG-FAIL (fdo#107704)

    
  {name}: This element is suppressed. This means it is ignored when computing
          the status of the difference (SUCCESS, WARNING, or FAILURE).

  fdo#103713 https://bugs.freedesktop.org/show_bug.cgi?id=103713
  fdo#103841 https://bugs.freedesktop.org/show_bug.cgi?id=103841
  fdo#103927 https://bugs.freedesktop.org/show_bug.cgi?id=103927
  fdo#107704 https://bugs.freedesktop.org/show_bug.cgi?id=107704


== Participating hosts (53 -> 49) ==

  Additional (1): fi-bxt-dsi 
  Missing    (5): fi-ctg-p8600 fi-ilk-m540 fi-byt-squawks fi-bsw-cyan fi-hsw-4200u 


== Build changes ==

    * Linux: CI_DRM_4715 -> Trybot_2830

  CI_DRM_4715: 1b73a69651beab39192502181c83e77a1022014a @ git://anongit.freedesktop.org/gfx-ci/linux
  IGT_4610: c40743d3fce5055682d31610519758dd7379c0f8 @ git://anongit.freedesktop.org/xorg/app/intel-gpu-tools
  Trybot_2830: 2f804c97a80dc836aedca1c57a76cd6db4e1b8a7 @ git://anongit.freedesktop.org/gfx-ci/linux


== Kernel 32bit build ==

Warning: Kernel 32bit buildtest failed:
https://intel-gfx-ci.01.org/tree/drm-tip/Trybot_2830/build_32bit.log

  CALL    scripts/checksyscalls.sh
  CHK     include/generated/compile.h
  CC [M]  drivers/gpu/drm/i915/i915_gem_context.o
In file included from ./include/linux/printk.h:7:0,
                 from ./include/linux/kernel.h:14,
                 from ./include/linux/list.h:9,
                 from ./include/linux/agp_backend.h:33,
                 from ./include/drm/drmP.h:35,
                 from drivers/gpu/drm/i915/i915_gem_context.c:89:
drivers/gpu/drm/i915/selftests/i915_gem_context.c: In function ‘igt_ctx_sseu’:
./include/linux/kern_levels.h:5:18: error: format ‘%lu’ expects argument of type ‘long unsigned int’, but argument 4 has type ‘unsigned int’ [-Werror=format=]
 #define KERN_SOH "\001"  /* ASCII Start Of Header */
                  ^
./include/linux/kern_levels.h:14:19: note: in expansion of macro ‘KERN_SOH’
 #define KERN_INFO KERN_SOH "6" /* informational */
                   ^~~~~~~~
./include/linux/printk.h:315:9: note: in expansion of macro ‘KERN_INFO’
  printk(KERN_INFO pr_fmt(fmt), ##__VA_ARGS__)
         ^~~~~~~~~
drivers/gpu/drm/i915/selftests/i915_gem_context.c:678:3: note: in expansion of macro ‘pr_info’
   pr_info("%u:    Submitted %lu queries across %lu contexts\n",
   ^~~~~~~
In file included from drivers/gpu/drm/i915/i915_gem_context.c:1213:0:
drivers/gpu/drm/i915/selftests/i915_gem_context.c:678:50: note: format string is defined here
   pr_info("%u:    Submitted %lu queries across %lu contexts\n",
                                                ~~^
                                                %u
cc1: all warnings being treated as errors
scripts/Makefile.build:307: recipe for target 'drivers/gpu/drm/i915/i915_gem_context.o' failed
make[4]: *** [drivers/gpu/drm/i915/i915_gem_context.o] Error 1
scripts/Makefile.build:548: recipe for target 'drivers/gpu/drm/i915' failed
make[3]: *** [drivers/gpu/drm/i915] Error 2
scripts/Makefile.build:548: recipe for target 'drivers/gpu/drm' failed
make[2]: *** [drivers/gpu/drm] Error 2
scripts/Makefile.build:548: recipe for target 'drivers/gpu' failed
make[1]: *** [drivers/gpu] Error 2
Makefile:1057: recipe for target 'drivers' failed
make: *** [drivers] Error 2


== Linux commits ==

2f804c97a80d sseu test
dc2d7cbeadd5 drm/i915: Expose RPCS (SSEU) configuration to userspace
0b591e4d06c3 drm/i915: Explicitly mark Global GTT address spaces
0494449e3fcf drm/i915: Add timeline barrier support
3b0f14e21826 drm/i915/perf: lock powergating configuration to default when active
d59452cfc4fe drm/i915/perf: reuse intel_lrc ctx regs macro
2acfbd288fb0 drm/i915/perf: simplify configure all context function
4b533fac281c drm/i915: Record the sseu configuration per-context & engine
d082937056c0 drm/i915: Program RPCS for Broadwell
780039ded78c drm/i915/icl: Fix context slice count configuration
8248f607ea89 drm/i915: Fix subslice configuration on Gen9LP

Patches download mbox

Tests

= CI Bug Log - changes from CI_DRM_4718 -> Trybot_2831 =

== Summary - SUCCESS ==

  No regressions found.

  External URL: https://patchwork.freedesktop.org/api/1.0/series/48662/revisions/5/mbox/

== Known issues ==

  Here are the changes found in Trybot_2831 that come from known issues:

  === IGT changes ===

    ==== Issues hit ====

    igt@gem_exec_suspend@basic-s3:
      fi-blb-e6850:       PASS -> INCOMPLETE (fdo#107718)

    igt@gem_exec_suspend@basic-s4-devices:
      fi-kbl-7500u:       PASS -> DMESG-WARN (fdo#105128, fdo#107139)

    igt@kms_frontbuffer_tracking@basic:
      {fi-byt-clapper}:   PASS -> FAIL (fdo#103167)

    
    ==== Possible fixes ====

    igt@drv_selftest@live_hangcheck:
      {fi-cfl-8109u}:     DMESG-FAIL (fdo#106560) -> PASS

    igt@kms_pipe_crc_basic@suspend-read-crc-pipe-b:
      fi-snb-2520m:       INCOMPLETE (fdo#103713) -> PASS

    {igt@pm_rpm@module-reload}:
      fi-cnl-psr:         WARN (fdo#107708, fdo#107602) -> PASS

    
  {name}: This element is suppressed. This means it is ignored when computing
          the status of the difference (SUCCESS, WARNING, or FAILURE).

  fdo#103167 https://bugs.freedesktop.org/show_bug.cgi?id=103167
  fdo#103713 https://bugs.freedesktop.org/show_bug.cgi?id=103713
  fdo#105128 https://bugs.freedesktop.org/show_bug.cgi?id=105128
  fdo#106560 https://bugs.freedesktop.org/show_bug.cgi?id=106560
  fdo#107139 https://bugs.freedesktop.org/show_bug.cgi?id=107139
  fdo#107602 https://bugs.freedesktop.org/show_bug.cgi?id=107602
  fdo#107708 https://bugs.freedesktop.org/show_bug.cgi?id=107708
  fdo#107718 https://bugs.freedesktop.org/show_bug.cgi?id=107718


== Participating hosts (54 -> 49) ==

  Missing    (5): fi-ctg-p8600 fi-ilk-m540 fi-byt-squawks fi-bsw-cyan fi-hsw-4200u 


== Build changes ==

    * Linux: CI_DRM_4718 -> Trybot_2831

  CI_DRM_4718: c7398fd19cef9b11c79af7292109507b6be075c4 @ git://anongit.freedesktop.org/gfx-ci/linux
  IGT_4611: b966dd93a30f41581fe1dbf9bc1c4a29b552ca05 @ git://anongit.freedesktop.org/xorg/app/intel-gpu-tools
  Trybot_2831: 80c2fefb7b9c2f8d132e35032ba586ad38b8f2a1 @ git://anongit.freedesktop.org/gfx-ci/linux


== Kernel 32bit build ==

Warning: Kernel 32bit buildtest failed:
https://intel-gfx-ci.01.org/tree/drm-tip/Trybot_2831/build_32bit.log

  CALL    scripts/checksyscalls.sh
  CHK     include/generated/compile.h
  CC [M]  drivers/gpu/drm/i915/i915_gem_context.o
In file included from ./include/linux/printk.h:7:0,
                 from ./include/linux/kernel.h:14,
                 from ./include/linux/list.h:9,
                 from ./include/linux/agp_backend.h:33,
                 from ./include/drm/drmP.h:35,
                 from drivers/gpu/drm/i915/i915_gem_context.c:89:
drivers/gpu/drm/i915/selftests/i915_gem_context.c: In function ‘igt_ctx_sseu’:
./include/linux/kern_levels.h:5:18: error: format ‘%lu’ expects argument of type ‘long unsigned int’, but argument 4 has type ‘unsigned int’ [-Werror=format=]
 #define KERN_SOH "\001"  /* ASCII Start Of Header */
                  ^
./include/linux/kern_levels.h:14:19: note: in expansion of macro ‘KERN_SOH’
 #define KERN_INFO KERN_SOH "6" /* informational */
                   ^~~~~~~~
./include/linux/printk.h:315:9: note: in expansion of macro ‘KERN_INFO’
  printk(KERN_INFO pr_fmt(fmt), ##__VA_ARGS__)
         ^~~~~~~~~
drivers/gpu/drm/i915/selftests/i915_gem_context.c:661:3: note: in expansion of macro ‘pr_info’
   pr_info("%u:    Submitted %lu queries across %lu contexts\n",
   ^~~~~~~
In file included from drivers/gpu/drm/i915/i915_gem_context.c:1213:0:
drivers/gpu/drm/i915/selftests/i915_gem_context.c:661:50: note: format string is defined here
   pr_info("%u:    Submitted %lu queries across %lu contexts\n",
                                                ~~^
                                                %u
cc1: all warnings being treated as errors
scripts/Makefile.build:307: recipe for target 'drivers/gpu/drm/i915/i915_gem_context.o' failed
make[4]: *** [drivers/gpu/drm/i915/i915_gem_context.o] Error 1
scripts/Makefile.build:548: recipe for target 'drivers/gpu/drm/i915' failed
make[3]: *** [drivers/gpu/drm/i915] Error 2
scripts/Makefile.build:548: recipe for target 'drivers/gpu/drm' failed
make[2]: *** [drivers/gpu/drm] Error 2
scripts/Makefile.build:548: recipe for target 'drivers/gpu' failed
make[1]: *** [drivers/gpu] Error 2
Makefile:1057: recipe for target 'drivers' failed
make: *** [drivers] Error 2


== Linux commits ==

80c2fefb7b9c sseu test
214abfbed33a drm/i915: Expose RPCS (SSEU) configuration to userspace
8a6d7515fd44 drm/i915: Explicitly mark Global GTT address spaces
50a3fd6442a9 drm/i915: Add timeline barrier support
cc4752267f22 drm/i915/perf: lock powergating configuration to default when active
3111e8a904ae drm/i915/perf: reuse intel_lrc ctx regs macro
80b2a74e46ae drm/i915/perf: simplify configure all context function
15d1a569bf25 drm/i915: Record the sseu configuration per-context & engine
d6e8b54e6103 drm/i915: Program RPCS for Broadwell
ad2729551670 drm/i915/icl: Fix context slice count configuration
f7a91ab744ac drm/i915: Fix subslice configuration on Gen9LP
= CI Bug Log - changes from CI_DRM_4718_full -> Trybot_2831_full =

== Summary - FAILURE ==

  Serious unknown changes coming with Trybot_2831_full absolutely need to be
  verified manually.
  
  If you think the reported changes have nothing to do with the changes
  introduced in Trybot_2831_full, please notify your bug team to allow them
  to document this new failure mode, which will reduce false positives in CI.

  

== Possible new issues ==

  Here are the unknown changes that may have been introduced in Trybot_2831_full:

  === IGT changes ===

    ==== Possible regressions ====

    igt@gem_ctx_param@invalid-param-get:
      shard-apl:          PASS -> FAIL
      shard-glk:          PASS -> FAIL
      shard-kbl:          PASS -> FAIL

    igt@gem_ctx_param@invalid-param-set:
      shard-kbl:          PASS -> DMESG-FAIL
      shard-hsw:          PASS -> FAIL +1
      shard-snb:          PASS -> FAIL +1
      shard-glk:          PASS -> DMESG-FAIL
      shard-apl:          PASS -> DMESG-FAIL

    
== Known issues ==

  Here are the changes found in Trybot_2831_full that come from known issues:

  === IGT changes ===

    ==== Issues hit ====

    igt@kms_cursor_crc@cursor-64x64-suspend:
      shard-kbl:          PASS -> INCOMPLETE (fdo#107556, fdo#103665)

    igt@kms_setmode@basic:
      shard-kbl:          PASS -> FAIL (fdo#99912)

    
    ==== Possible fixes ====

    igt@kms_draw_crc@draw-method-xrgb8888-blt-ytiled:
      shard-glk:          FAIL (fdo#107589) -> PASS

    igt@kms_flip@2x-flip-vs-expired-vblank:
      shard-glk:          FAIL (fdo#105363) -> PASS

    igt@kms_pipe_crc_basic@read-crc-pipe-b:
      shard-glk:          DMESG-WARN (fdo#105763) -> PASS +1

    
  fdo#103665 https://bugs.freedesktop.org/show_bug.cgi?id=103665
  fdo#105363 https://bugs.freedesktop.org/show_bug.cgi?id=105363
  fdo#105763 https://bugs.freedesktop.org/show_bug.cgi?id=105763
  fdo#107556 https://bugs.freedesktop.org/show_bug.cgi?id=107556
  fdo#107589 https://bugs.freedesktop.org/show_bug.cgi?id=107589
  fdo#99912 https://bugs.freedesktop.org/show_bug.cgi?id=99912


== Participating hosts (5 -> 5) ==

  No changes in participating hosts


== Build changes ==

    * Linux: CI_DRM_4718 -> Trybot_2831

  CI_DRM_4718: c7398fd19cef9b11c79af7292109507b6be075c4 @ git://anongit.freedesktop.org/gfx-ci/linux
  IGT_4611: b966dd93a30f41581fe1dbf9bc1c4a29b552ca05 @ git://anongit.freedesktop.org/xorg/app/intel-gpu-tools
  Trybot_2831: 80c2fefb7b9c2f8d132e35032ba586ad38b8f2a1 @ git://anongit.freedesktop.org/gfx-ci/linux
  piglit_4509: fdc5a4ca11124ab8413c7988896eec4c97336694 @ git://anongit.freedesktop.org/piglit