Add NV12 support

Submitted by vsrini4 on Feb. 25, 2018, 9 a.m.

Details

Reviewer None
Submitted Feb. 25, 2018, 9 a.m.
Last Updated April 9, 2018, 12:32 p.m.
Revision 36

Revisions

Patches download mbox

Tests

Series 38919v1 Add NV12 support
https://patchwork.freedesktop.org/api/1.0/series/38919/revisions/1/mbox/

Test gem_mmap_gtt:
        Subgroup basic-small-bo-tiledx:
                fail       -> PASS       (fi-gdg-551) fdo#102575
Test kms_chamelium:
        Subgroup dp-edid-read:
                fail       -> PASS       (fi-kbl-7500u) fdo#102505
Test kms_force_connector_basic:
        Subgroup force-connector-state:
                skip       -> PASS       (fi-snb-2520m)
        Subgroup force-edid:
                skip       -> PASS       (fi-snb-2520m)
        Subgroup force-load-detect:
                skip       -> PASS       (fi-snb-2520m)
        Subgroup prune-stale-modes:
                skip       -> PASS       (fi-snb-2520m)
Test kms_pipe_crc_basic:
        Subgroup suspend-read-crc-pipe-c:
                incomplete -> PASS       (fi-bxt-dsi) fdo#103927
Test prime_vgem:
        Subgroup basic-fence-flip:
                pass       -> FAIL       (fi-ilk-650) fdo#104008

fdo#102575 https://bugs.freedesktop.org/show_bug.cgi?id=102575
fdo#102505 https://bugs.freedesktop.org/show_bug.cgi?id=102505
fdo#103927 https://bugs.freedesktop.org/show_bug.cgi?id=103927
fdo#104008 https://bugs.freedesktop.org/show_bug.cgi?id=104008

fi-bdw-5557u     total:288  pass:267  dwarn:0   dfail:0   fail:0   skip:21  time:417s
fi-bdw-gvtdvm    total:288  pass:264  dwarn:0   dfail:0   fail:0   skip:24  time:425s
fi-blb-e6850     total:288  pass:223  dwarn:1   dfail:0   fail:0   skip:64  time:375s
fi-bsw-n3050     total:288  pass:242  dwarn:0   dfail:0   fail:0   skip:46  time:489s
fi-bwr-2160      total:288  pass:183  dwarn:0   dfail:0   fail:0   skip:105 time:285s
fi-bxt-dsi       total:288  pass:258  dwarn:0   dfail:0   fail:0   skip:30  time:481s
fi-bxt-j4205     total:288  pass:259  dwarn:0   dfail:0   fail:0   skip:29  time:484s
fi-byt-j1900     total:288  pass:253  dwarn:0   dfail:0   fail:0   skip:35  time:475s
fi-byt-n2820     total:288  pass:249  dwarn:0   dfail:0   fail:0   skip:39  time:458s
fi-cfl-8700k     total:288  pass:260  dwarn:0   dfail:0   fail:0   skip:28  time:392s
fi-cfl-s2        total:288  pass:262  dwarn:0   dfail:0   fail:0   skip:26  time:560s
fi-elk-e7500     total:288  pass:229  dwarn:0   dfail:0   fail:0   skip:59  time:422s
fi-gdg-551       total:288  pass:180  dwarn:0   dfail:0   fail:0   skip:108 time:284s
fi-glk-1         total:288  pass:260  dwarn:0   dfail:0   fail:0   skip:28  time:508s
fi-hsw-4770      total:288  pass:261  dwarn:0   dfail:0   fail:0   skip:27  time:394s
fi-ilk-650       total:288  pass:227  dwarn:0   dfail:0   fail:1   skip:60  time:411s
fi-ivb-3520m     total:288  pass:259  dwarn:0   dfail:0   fail:0   skip:29  time:452s
fi-kbl-7500u     total:288  pass:263  dwarn:1   dfail:0   fail:0   skip:24  time:451s
fi-kbl-7560u     total:288  pass:269  dwarn:0   dfail:0   fail:0   skip:19  time:492s
fi-kbl-7567u     total:288  pass:268  dwarn:0   dfail:0   fail:0   skip:20  time:447s
fi-kbl-r         total:288  pass:261  dwarn:0   dfail:0   fail:0   skip:27  time:495s
fi-pnv-d510      total:288  pass:222  dwarn:1   dfail:0   fail:0   skip:65  time:593s
fi-skl-6260u     total:288  pass:268  dwarn:0   dfail:0   fail:0   skip:20  time:429s
fi-skl-6600u     total:288  pass:261  dwarn:0   dfail:0   fail:0   skip:27  time:500s
fi-skl-6700hq    total:288  pass:262  dwarn:0   dfail:0   fail:0   skip:26  time:520s
fi-skl-6700k2    total:288  pass:264  dwarn:0   dfail:0   fail:0   skip:24  time:491s
fi-skl-6770hq    total:288  pass:268  dwarn:0   dfail:0   fail:0   skip:20  time:471s
fi-skl-guc       total:288  pass:260  dwarn:0   dfail:0   fail:0   skip:28  time:405s
fi-skl-gvtdvm    total:288  pass:265  dwarn:0   dfail:0   fail:0   skip:23  time:431s
fi-snb-2520m     total:288  pass:248  dwarn:0   dfail:0   fail:0   skip:40  time:519s
fi-snb-2600      total:288  pass:248  dwarn:0   dfail:0   fail:0   skip:40  time:392s

316ba650abe6c1e8ac2f812ff21eee5771546ba1 drm-tip: 2018y-02m-23d-16h-41m-52s UTC integration manifest
32b3efc94dbe drm/i915: Display WA 827
512e0f679337 drm/i915: Enable YUV to RGB for Gen10 in Plane Ctrl Reg
c0b3bce9f525 drm/i915: Add NV12 support to intel_framebuffer_init
32ea69819022 drm/i915: Add NV12 as supported format for sprite plane
bd32349a2f0b drm/i915: Add NV12 as supported format for primary plane
2fd8c0d756b1 drm/i915: Upscale scaler max scale for NV12
408d9f06b895 drm/i915: Update format_is_yuv() to include NV12
ba4a67f1e844 drm/i915: Set scaler mode for NV12
69d2fe319dd2 drm/i915/skl: split skl_compute_ddb function
b91b87d0c271 drm/i915/skl+: nv12 workaround disable WM level 1-7
a17c0102671f drm/i915/skl+: make sure higher latency level has higher wm value
5fe0654b085c drm/i915/skl+: pass skl_wm_level struct to wm compute func
0eb8b4e2448b drm/i915/skl+: NV12 related changes for WM
389723f11f9c drm/i915/skl+: support verification of DDB HW state for NV12
46b60a49d7e3 drm/i915/skl+: add NV12 in skl_format_to_fourcc
a0ec4c0d9ad3 drm/i915/skl+: refactor WM calculation for NV12
e090797def9d drm/i915/skl+: rename skl_wm_values struct to skl_ddb_values
Test kms_plane:
        Subgroup plane-position-hole-dpms-pipe-b-planes:
                fail       -> PASS       (shard-apl)
Test gem_eio:
        Subgroup in-flight:
                pass       -> INCOMPLETE (shard-apl) fdo#104945
Test kms_sysfs_edid_timing:
                pass       -> WARN       (shard-apl) fdo#100047
Test kms_chv_cursor_fail:
        Subgroup pipe-a-64x64-top-edge:
                fail       -> PASS       (shard-apl)
        Subgroup pipe-b-64x64-bottom-edge:
                pass       -> DMESG-WARN (shard-snb) fdo#105185
Test drv_suspend:
        Subgroup fence-restore-tiled2untiled:
                skip       -> PASS       (shard-hsw)
Test kms_plane_scaling:
        Subgroup pipe-b-scaler-with-rotation:
                pass       -> DMESG-WARN (shard-apl)
        Subgroup pipe-a-scaler-with-rotation:
                pass       -> DMESG-WARN (shard-apl)
Test kms_flip:
        Subgroup 2x-modeset-vs-vblank-race:
                pass       -> FAIL       (shard-hsw) fdo#103060
Test kms_cursor_crc:
        Subgroup cursor-64x64-suspend:
                pass       -> SKIP       (shard-snb) fdo#102365

fdo#104945 https://bugs.freedesktop.org/show_bug.cgi?id=104945
fdo#100047 https://bugs.freedesktop.org/show_bug.cgi?id=100047
fdo#105185 https://bugs.freedesktop.org/show_bug.cgi?id=105185
fdo#103060 https://bugs.freedesktop.org/show_bug.cgi?id=103060
fdo#102365 https://bugs.freedesktop.org/show_bug.cgi?id=102365

shard-apl        total:3457 pass:1814 dwarn:3   dfail:0   fail:12  skip:1626 time:11914s
shard-hsw        total:3465 pass:1767 dwarn:1   dfail:0   fail:3   skip:1693 time:11780s
shard-snb        total:3465 pass:1356 dwarn:2   dfail:0   fail:2   skip:2105 time:6621s
Blacklisted hosts:
shard-kbl        total:3460 pass:1955 dwarn:3   dfail:0   fail:14  skip:1486 time:9118s

Patches download mbox

Tests

  CHK     include/config/kernel.release
  CHK     include/generated/uapi/linux/version.h
  CHK     include/generated/utsrelease.h
  CHK     include/generated/bounds.h
  CHK     include/generated/timeconst.h
  CHK     include/generated/asm-offsets.h
  CALL    scripts/checksyscalls.sh
  DESCEND  objtool
  CHK     scripts/mod/devicetable-offsets.h
  CHK     include/generated/compile.h
  CHK     kernel/config_data.h
  CC [M]  drivers/gpu/drm/i915/intel_display.o
drivers/gpu/drm/i915/intel_display.c: In function ‘skl_check_plane_surface’:
drivers/gpu/drm/i915/intel_display.c:3243:4: error: this ‘if’ clause does not guard... [-Werror=misleading-indentation]
    if (!IS_GEMINILAKE(dev_priv))
    ^~
drivers/gpu/drm/i915/intel_display.c:3246:5: note: ...this statement, but the latter is misleadingly indented as if it is guarded by the ‘if’
     skl_wa_528(dev_priv,
     ^~~~~~~~~~
cc1: all warnings being treated as errors
scripts/Makefile.build:316: recipe for target 'drivers/gpu/drm/i915/intel_display.o' failed
make[4]: *** [drivers/gpu/drm/i915/intel_display.o] Error 1
scripts/Makefile.build:575: recipe for target 'drivers/gpu/drm/i915' failed
make[3]: *** [drivers/gpu/drm/i915] Error 2
scripts/Makefile.build:575: recipe for target 'drivers/gpu/drm' failed
make[2]: *** [drivers/gpu/drm] Error 2
scripts/Makefile.build:575: recipe for target 'drivers/gpu' failed
make[1]: *** [drivers/gpu] Error 2
Makefile:1048: recipe for target 'drivers' failed
make: *** [drivers] Error 2

Patches download mbox

Tests

  CHK     include/config/kernel.release
  CHK     include/generated/uapi/linux/version.h
  CHK     include/generated/utsrelease.h
  CHK     include/generated/bounds.h
  CHK     include/generated/timeconst.h
  CHK     include/generated/asm-offsets.h
  CALL    scripts/checksyscalls.sh
  DESCEND  objtool
  CHK     scripts/mod/devicetable-offsets.h
  CHK     include/generated/compile.h
  CHK     kernel/config_data.h
  CC [M]  drivers/gpu/drm/i915/intel_display.o
drivers/gpu/drm/i915/intel_display.c: In function ‘skl_check_plane_surface’:
drivers/gpu/drm/i915/intel_display.c:3243:4: error: this ‘if’ clause does not guard... [-Werror=misleading-indentation]
    if (!IS_GEMINILAKE(dev_priv))
    ^~
drivers/gpu/drm/i915/intel_display.c:3246:5: note: ...this statement, but the latter is misleadingly indented as if it is guarded by the ‘if’
     skl_wa_528(dev_priv,
     ^~~~~~~~~~
cc1: all warnings being treated as errors
scripts/Makefile.build:316: recipe for target 'drivers/gpu/drm/i915/intel_display.o' failed
make[4]: *** [drivers/gpu/drm/i915/intel_display.o] Error 1
scripts/Makefile.build:575: recipe for target 'drivers/gpu/drm/i915' failed
make[3]: *** [drivers/gpu/drm/i915] Error 2
scripts/Makefile.build:575: recipe for target 'drivers/gpu/drm' failed
make[2]: *** [drivers/gpu/drm] Error 2
scripts/Makefile.build:575: recipe for target 'drivers/gpu' failed
make[1]: *** [drivers/gpu] Error 2
Makefile:1048: recipe for target 'drivers' failed
make: *** [drivers] Error 2

Patches download mbox

Tests

Series 38919v4 Add NV12 support
https://patchwork.freedesktop.org/api/1.0/series/38919/revisions/4/mbox/

Test kms_busy:
        Subgroup basic-flip-a:
                pass       -> DMESG-WARN (fi-bxt-dsi)
                pass       -> DMESG-WARN (fi-bxt-j4205)
                pass       -> DMESG-WARN (fi-kbl-7500u)
                pass       -> DMESG-WARN (fi-kbl-7567u)
                pass       -> DMESG-WARN (fi-glk-1)
                pass       -> DMESG-WARN (fi-cfl-8700k)
Test kms_chamelium:
        Subgroup dp-edid-read:
                fail       -> PASS       (fi-kbl-7500u) fdo#102505
Test kms_flip:
        Subgroup basic-flip-vs-dpms:
                pass       -> DMESG-WARN (fi-cfl-s2)
Test kms_force_connector_basic:
        Subgroup force-connector-state:
                skip       -> PASS       (fi-snb-2520m)
                pass       -> SKIP       (fi-ivb-3520m)
        Subgroup force-edid:
                skip       -> PASS       (fi-snb-2520m)
                pass       -> SKIP       (fi-ivb-3520m)
        Subgroup force-load-detect:
                skip       -> PASS       (fi-snb-2520m)
                pass       -> SKIP       (fi-ivb-3520m)
        Subgroup prune-stale-modes:
                skip       -> PASS       (fi-snb-2520m)
                pass       -> SKIP       (fi-ivb-3520m)
Test kms_pipe_crc_basic:
        Subgroup suspend-read-crc-pipe-c:
                incomplete -> PASS       (fi-bxt-dsi) fdo#103927
Test pm_rpm:
        Subgroup basic-pci-d3-state:
                pass       -> DMESG-WARN (fi-bxt-j4205)
                pass       -> DMESG-WARN (fi-kbl-7500u)
                pass       -> DMESG-WARN (fi-kbl-7560u)
                pass       -> DMESG-WARN (fi-kbl-7567u)
                pass       -> DMESG-WARN (fi-kbl-r)
                pass       -> DMESG-WARN (fi-glk-1)
                pass       -> DMESG-WARN (fi-cfl-8700k)
                pass       -> DMESG-WARN (fi-cfl-s2)
Test prime_vgem:
        Subgroup basic-fence-flip:
                pass       -> FAIL       (fi-ilk-650) fdo#104008
Test drv_module_reload:
        Subgroup basic-reload:
                pass       -> DMESG-WARN (fi-kbl-7500u)
                pass       -> DMESG-WARN (fi-kbl-7567u) fdo#105078 +2
        Subgroup basic-no-display:
                pass       -> DMESG-WARN (fi-kbl-7500u)
        Subgroup basic-reload-inject:
                pass       -> DMESG-WARN (fi-kbl-7500u)

fdo#102505 https://bugs.freedesktop.org/show_bug.cgi?id=102505
fdo#103927 https://bugs.freedesktop.org/show_bug.cgi?id=103927
fdo#104008 https://bugs.freedesktop.org/show_bug.cgi?id=104008
fdo#105078 https://bugs.freedesktop.org/show_bug.cgi?id=105078

fi-bdw-5557u     total:288  pass:267  dwarn:0   dfail:0   fail:0   skip:21  time:416s
fi-bdw-gvtdvm    total:288  pass:264  dwarn:0   dfail:0   fail:0   skip:24  time:425s
fi-blb-e6850     total:288  pass:223  dwarn:1   dfail:0   fail:0   skip:64  time:377s
fi-bsw-n3050     total:288  pass:242  dwarn:0   dfail:0   fail:0   skip:46  time:489s
fi-bwr-2160      total:288  pass:183  dwarn:0   dfail:0   fail:0   skip:105 time:285s
fi-bxt-dsi       total:288  pass:256  dwarn:2   dfail:0   fail:0   skip:30  time:481s
fi-bxt-j4205     total:288  pass:257  dwarn:2   dfail:0   fail:0   skip:29  time:483s
fi-byt-j1900     total:288  pass:253  dwarn:0   dfail:0   fail:0   skip:35  time:469s
fi-byt-n2820     total:288  pass:249  dwarn:0   dfail:0   fail:0   skip:39  time:459s
fi-cfl-8700k     total:288  pass:258  dwarn:2   dfail:0   fail:0   skip:28  time:391s
fi-cfl-s2        total:288  pass:260  dwarn:2   dfail:0   fail:0   skip:26  time:564s
fi-elk-e7500     total:288  pass:229  dwarn:0   dfail:0   fail:0   skip:59  time:414s
fi-gdg-551       total:288  pass:179  dwarn:0   dfail:0   fail:1   skip:108 time:285s
fi-glk-1         total:288  pass:258  dwarn:2   dfail:0   fail:0   skip:28  time:508s
fi-hsw-4770      total:288  pass:261  dwarn:0   dfail:0   fail:0   skip:27  time:391s
fi-ilk-650       total:288  pass:227  dwarn:0   dfail:0   fail:1   skip:60  time:414s
fi-ivb-3520m     total:288  pass:255  dwarn:0   dfail:0   fail:0   skip:33  time:447s
fi-kbl-7500u     total:288  pass:258  dwarn:6   dfail:0   fail:0   skip:24  time:451s
fi-kbl-7560u     total:288  pass:268  dwarn:1   dfail:0   fail:0   skip:19  time:488s
fi-kbl-7567u     total:288  pass:263  dwarn:5   dfail:0   fail:0   skip:20  time:451s
fi-kbl-r         total:288  pass:260  dwarn:1   dfail:0   fail:0   skip:27  time:496s
fi-pnv-d510      total:288  pass:222  dwarn:1   dfail:0   fail:0   skip:65  time:589s
fi-skl-6260u     total:288  pass:268  dwarn:0   dfail:0   fail:0   skip:20  time:432s
fi-skl-6600u     total:288  pass:261  dwarn:0   dfail:0   fail:0   skip:27  time:501s
fi-skl-6700hq    total:288  pass:262  dwarn:0   dfail:0   fail:0   skip:26  time:518s
fi-skl-6700k2    total:288  pass:264  dwarn:0   dfail:0   fail:0   skip:24  time:487s
fi-skl-6770hq    total:288  pass:268  dwarn:0   dfail:0   fail:0   skip:20  time:469s
fi-skl-guc       total:288  pass:260  dwarn:0   dfail:0   fail:0   skip:28  time:408s
fi-skl-gvtdvm    total:288  pass:265  dwarn:0   dfail:0   fail:0   skip:23  time:429s
fi-snb-2520m     total:288  pass:248  dwarn:0   dfail:0   fail:0   skip:40  time:524s
fi-snb-2600      total:288  pass:248  dwarn:0   dfail:0   fail:0   skip:40  time:395s

316ba650abe6c1e8ac2f812ff21eee5771546ba1 drm-tip: 2018y-02m-23d-16h-41m-52s UTC integration manifest
ffa220e1b2b4 drm/i915: Display WA 528, 857, 1142
9e40147c951f drm/i915: Display WA 827
f99ea0a57f61 drm/i915: Enable YUV to RGB for Gen10 in Plane Ctrl Reg
e0740e8e966b drm/i915: Add NV12 support to intel_framebuffer_init
d493ba0dedee drm/i915: Add NV12 as supported format for sprite plane
8489381fdef1 drm/i915: Add NV12 as supported format for primary plane
0db7e8da1e9a drm/i915: Upscale scaler max scale for NV12
ebe7d0c3df55 drm/i915: Update format_is_yuv() to include NV12
6a0708894633 drm/i915: Set scaler mode for NV12
198ce78649e6 drm/i915/skl: split skl_compute_ddb function
207eb8f25d48 drm/i915/skl+: nv12 workaround disable WM level 1-7
17cf5f3ede4f drm/i915/skl+: make sure higher latency level has higher wm value
840a4c129d2c drm/i915/skl+: pass skl_wm_level struct to wm compute func
b25467d877f4 drm/i915/skl+: NV12 related changes for WM
d7ff2d09e4ed drm/i915/skl+: support verification of DDB HW state for NV12
5357dfc51427 drm/i915/skl+: add NV12 in skl_format_to_fourcc
b67c016e7f83 drm/i915/skl+: refactor WM calculation for NV12
8e715a690813 drm/i915/skl+: rename skl_wm_values struct to skl_ddb_values

Patches download mbox

Tests

CHK     include/config/kernel.release
  CHK     include/generated/uapi/linux/version.h
  CHK     include/generated/utsrelease.h
  CHK     include/generated/bounds.h
  CHK     include/generated/timeconst.h
  CHK     include/generated/asm-offsets.h
  CALL    scripts/checksyscalls.sh
  DESCEND  objtool
  CHK     scripts/mod/devicetable-offsets.h
  CHK     include/generated/compile.h
  CHK     kernel/config_data.h
  CC [M]  drivers/gpu/drm/i915/intel_display.o
drivers/gpu/drm/i915/intel_display.c: In function ‘skl_plane_has_planar’:
drivers/gpu/drm/i915/intel_display.c:13351:1: error: control reaches end of non-void function [-Werror=return-type]
 }
 ^
cc1: all warnings being treated as errors
scripts/Makefile.build:324: recipe for target 'drivers/gpu/drm/i915/intel_display.o' failed
make[4]: *** [drivers/gpu/drm/i915/intel_display.o] Error 1
scripts/Makefile.build:583: recipe for target 'drivers/gpu/drm/i915' failed
make[3]: *** [drivers/gpu/drm/i915] Error 2
scripts/Makefile.build:583: recipe for target 'drivers/gpu/drm' failed
make[2]: *** [drivers/gpu/drm] Error 2
scripts/Makefile.build:583: recipe for target 'drivers/gpu' failed
make[1]: *** [drivers/gpu] Error 2
Makefile:1051: recipe for target 'drivers' failed
make: *** [drivers] Error 2

Patches download mbox

Tests

Series 38919v6 Add NV12 support
https://patchwork.freedesktop.org/api/1.0/series/38919/revisions/6/mbox/

---- Possible new issues:

Test gem_exec_suspend:
        Subgroup basic-s4-devices:
                pass       -> DMESG-WARN (fi-kbl-7500u)
Test kms_busy:
        Subgroup basic-flip-a:
                pass       -> DMESG-WARN (fi-kbl-r)

---- Known issues:

Test prime_vgem:
        Subgroup basic-fence-flip:
                fail       -> PASS       (fi-ilk-650) fdo#104008

fdo#104008 https://bugs.freedesktop.org/show_bug.cgi?id=104008

fi-bdw-5557u     total:288  pass:267  dwarn:0   dfail:0   fail:0   skip:21  time:429s
fi-bdw-gvtdvm    total:288  pass:264  dwarn:0   dfail:0   fail:0   skip:24  time:425s
fi-blb-e6850     total:288  pass:223  dwarn:1   dfail:0   fail:0   skip:64  time:373s
fi-bsw-n3050     total:288  pass:242  dwarn:0   dfail:0   fail:0   skip:46  time:493s
fi-bwr-2160      total:288  pass:183  dwarn:0   dfail:0   fail:0   skip:105 time:280s
fi-bxt-j4205     total:288  pass:259  dwarn:0   dfail:0   fail:0   skip:29  time:491s
fi-byt-j1900     total:288  pass:253  dwarn:0   dfail:0   fail:0   skip:35  time:479s
fi-byt-n2820     total:288  pass:249  dwarn:0   dfail:0   fail:0   skip:39  time:469s
fi-cfl-8700k     total:288  pass:260  dwarn:0   dfail:0   fail:0   skip:28  time:402s
fi-cfl-s2        total:288  pass:262  dwarn:0   dfail:0   fail:0   skip:26  time:584s
fi-cfl-u         total:288  pass:262  dwarn:0   dfail:0   fail:0   skip:26  time:508s
fi-elk-e7500     total:288  pass:229  dwarn:0   dfail:0   fail:0   skip:59  time:414s
fi-gdg-551       total:288  pass:179  dwarn:0   dfail:0   fail:1   skip:108 time:288s
fi-glk-1         total:288  pass:260  dwarn:0   dfail:0   fail:0   skip:28  time:517s
fi-hsw-4770      total:288  pass:261  dwarn:0   dfail:0   fail:0   skip:27  time:396s
fi-ilk-650       total:288  pass:228  dwarn:0   dfail:0   fail:0   skip:60  time:407s
fi-ivb-3520m     total:288  pass:259  dwarn:0   dfail:0   fail:0   skip:29  time:465s
fi-ivb-3770      total:288  pass:255  dwarn:0   dfail:0   fail:0   skip:33  time:425s
fi-kbl-7500u     total:288  pass:262  dwarn:2   dfail:0   fail:0   skip:24  time:467s
fi-kbl-7560u     total:108  pass:104  dwarn:0   dfail:0   fail:0   skip:3  
fi-kbl-7567u     total:288  pass:268  dwarn:0   dfail:0   fail:0   skip:20  time:462s
fi-kbl-r         total:288  pass:260  dwarn:1   dfail:0   fail:0   skip:27  time:505s
fi-pnv-d510      total:288  pass:222  dwarn:1   dfail:0   fail:0   skip:65  time:586s
fi-skl-6260u     total:288  pass:268  dwarn:0   dfail:0   fail:0   skip:20  time:436s
fi-skl-6600u     total:288  pass:261  dwarn:0   dfail:0   fail:0   skip:27  time:523s
fi-skl-6700hq    total:288  pass:262  dwarn:0   dfail:0   fail:0   skip:26  time:536s
fi-skl-6700k2    total:288  pass:264  dwarn:0   dfail:0   fail:0   skip:24  time:500s
fi-skl-6770hq    total:288  pass:268  dwarn:0   dfail:0   fail:0   skip:20  time:486s
fi-skl-guc       total:288  pass:260  dwarn:0   dfail:0   fail:0   skip:28  time:423s
fi-skl-gvtdvm    total:288  pass:265  dwarn:0   dfail:0   fail:0   skip:23  time:427s
fi-snb-2520m     total:288  pass:248  dwarn:0   dfail:0   fail:0   skip:40  time:520s
fi-snb-2600      total:288  pass:248  dwarn:0   dfail:0   fail:0   skip:40  time:394s

8a4eb4556f66d7ab7ad512d5c3d239da8de6b750 drm-tip: 2018y-03m-06d-22h-59m-29s UTC integration manifest
4290b51af469 drm/i915: Display WA 827
4a20fade61df drm/i915: Enable YUV to RGB for Gen10 in Plane Ctrl Reg
1879276d10aa drm/i915: Add NV12 support to intel_framebuffer_init
7ecef521945c drm/i915: Add NV12 as supported format for sprite plane
928bf4ef0774 drm/i915: Add NV12 as supported format for primary plane
8891d5c67c07 drm/i915: Upscale scaler max scale for NV12
3a2497a64a31 drm/i915: Update format_is_yuv() to include NV12
33667c2e923e drm/i915: Set scaler mode for NV12
5f9e8c93d86e drm/i915/skl: split skl_compute_ddb function
ab743a35a11b drm/i915/skl+: nv12 workaround disable WM level 1-7
a4a3fa533149 drm/i915/skl+: make sure higher latency level has higher wm value
8b15d6d90022 drm/i915/skl+: pass skl_wm_level struct to wm compute func
53ef591fba70 drm/i915/skl+: NV12 related changes for WM
9bf2c692cc50 drm/i915/skl+: support verification of DDB HW state for NV12
06f13d28bc72 drm/i915/skl+: add NV12 in skl_format_to_fourcc
2f7aec509ca4 drm/i915/skl+: refactor WM calculation for NV12
32c0b773c691 drm/i915/skl+: rename skl_wm_values struct to skl_ddb_values

Patches download mbox

Tests

Series 38919v7 Add NV12 support
https://patchwork.freedesktop.org/api/1.0/series/38919/revisions/7/mbox/

---- Known issues:

Test kms_pipe_crc_basic:
        Subgroup suspend-read-crc-pipe-a:
                pass       -> INCOMPLETE (fi-hsw-4770) fdo#104944
Test prime_vgem:
        Subgroup basic-fence-flip:
                fail       -> PASS       (fi-ilk-650) fdo#104008

fdo#104944 https://bugs.freedesktop.org/show_bug.cgi?id=104944
fdo#104008 https://bugs.freedesktop.org/show_bug.cgi?id=104008

fi-bdw-5557u     total:288  pass:267  dwarn:0   dfail:0   fail:0   skip:21  time:424s
fi-bdw-gvtdvm    total:288  pass:264  dwarn:0   dfail:0   fail:0   skip:24  time:422s
fi-blb-e6850     total:288  pass:223  dwarn:1   dfail:0   fail:0   skip:64  time:370s
fi-bsw-n3050     total:288  pass:242  dwarn:0   dfail:0   fail:0   skip:46  time:492s
fi-bwr-2160      total:288  pass:183  dwarn:0   dfail:0   fail:0   skip:105 time:278s
fi-bxt-j4205     total:288  pass:259  dwarn:0   dfail:0   fail:0   skip:29  time:490s
fi-byt-j1900     total:288  pass:253  dwarn:0   dfail:0   fail:0   skip:35  time:479s
fi-byt-n2820     total:288  pass:249  dwarn:0   dfail:0   fail:0   skip:39  time:471s
fi-cfl-8700k     total:288  pass:260  dwarn:0   dfail:0   fail:0   skip:28  time:403s
fi-cfl-s2        total:288  pass:262  dwarn:0   dfail:0   fail:0   skip:26  time:572s
fi-cfl-u         total:288  pass:262  dwarn:0   dfail:0   fail:0   skip:26  time:506s
fi-elk-e7500     total:288  pass:229  dwarn:0   dfail:0   fail:0   skip:59  time:414s
fi-gdg-551       total:288  pass:179  dwarn:0   dfail:0   fail:1   skip:108 time:287s
fi-glk-1         total:288  pass:260  dwarn:0   dfail:0   fail:0   skip:28  time:515s
fi-hsw-4770      total:244  pass:220  dwarn:0   dfail:0   fail:0   skip:23 
fi-ilk-650       total:288  pass:228  dwarn:0   dfail:0   fail:0   skip:60  time:406s
fi-ivb-3520m     total:288  pass:259  dwarn:0   dfail:0   fail:0   skip:29  time:465s
fi-ivb-3770      total:288  pass:255  dwarn:0   dfail:0   fail:0   skip:33  time:420s
fi-kbl-7500u     total:288  pass:263  dwarn:1   dfail:0   fail:0   skip:24  time:475s
fi-kbl-7560u     total:108  pass:104  dwarn:0   dfail:0   fail:0   skip:3  
fi-kbl-7567u     total:288  pass:268  dwarn:0   dfail:0   fail:0   skip:20  time:457s
fi-kbl-r         total:288  pass:261  dwarn:0   dfail:0   fail:0   skip:27  time:511s
fi-pnv-d510      total:288  pass:222  dwarn:1   dfail:0   fail:0   skip:65  time:586s
fi-skl-6260u     total:288  pass:268  dwarn:0   dfail:0   fail:0   skip:20  time:436s
fi-skl-6600u     total:288  pass:261  dwarn:0   dfail:0   fail:0   skip:27  time:520s
fi-skl-6700hq    total:288  pass:262  dwarn:0   dfail:0   fail:0   skip:26  time:531s
fi-skl-6700k2    total:288  pass:264  dwarn:0   dfail:0   fail:0   skip:24  time:500s
fi-skl-6770hq    total:288  pass:268  dwarn:0   dfail:0   fail:0   skip:20  time:484s
fi-skl-guc       total:288  pass:260  dwarn:0   dfail:0   fail:0   skip:28  time:424s
fi-skl-gvtdvm    total:288  pass:265  dwarn:0   dfail:0   fail:0   skip:23  time:430s
fi-snb-2520m     total:288  pass:248  dwarn:0   dfail:0   fail:0   skip:40  time:521s
fi-snb-2600      total:288  pass:248  dwarn:0   dfail:0   fail:0   skip:40  time:390s

8a4eb4556f66d7ab7ad512d5c3d239da8de6b750 drm-tip: 2018y-03m-06d-22h-59m-29s UTC integration manifest
c76214c7f907 drm/i915: Display WA 827
1a092be17230 drm/i915: Enable YUV to RGB for Gen10 in Plane Ctrl Reg
c2ac2040087a drm/i915: Add NV12 support to intel_framebuffer_init
e576c72b2950 drm/i915: Add NV12 as supported format for sprite plane
730901b7b4fb drm/i915: Add NV12 as supported format for primary plane
b2eb96646251 drm/i915: Upscale scaler max scale for NV12
8ca2c1459a87 drm/i915: Update format_is_yuv() to include NV12
eb17563c5251 drm/i915: Set scaler mode for NV12
9f12e1b7acf7 drm/i915/skl: split skl_compute_ddb function
cf1640b20cc0 drm/i915/skl+: nv12 workaround disable WM level 1-7
6f2a206b6afd drm/i915/skl+: make sure higher latency level has higher wm value
b384319dd36f drm/i915/skl+: pass skl_wm_level struct to wm compute func
94cc59957472 drm/i915/skl+: NV12 related changes for WM
b30ee93a4fb2 drm/i915/skl+: support verification of DDB HW state for NV12
73cad3c648aa drm/i915/skl+: add NV12 in skl_format_to_fourcc
ad3bd980d424 drm/i915/skl+: refactor WM calculation for NV12
888b328ea8b8 drm/i915/skl+: rename skl_wm_values struct to skl_ddb_values
---- Possible new issues:

Test kms_plane:
        Subgroup pixel-format-pipe-a-planes:
                pass       -> FAIL       (shard-apl)
        Subgroup pixel-format-pipe-b-planes:
                pass       -> FAIL       (shard-apl)
Test kms_plane_scaling:
        Subgroup pipe-a-scaler-with-clipping-clamping:
                pass       -> FAIL       (shard-apl)
        Subgroup pipe-a-scaler-with-pixel-format:
                pass       -> FAIL       (shard-apl)
        Subgroup pipe-a-scaler-with-rotation:
                pass       -> FAIL       (shard-apl)
        Subgroup pipe-b-scaler-with-clipping-clamping:
                pass       -> FAIL       (shard-apl)
        Subgroup pipe-b-scaler-with-pixel-format:
                pass       -> FAIL       (shard-apl)
        Subgroup pipe-b-scaler-with-rotation:
                pass       -> FAIL       (shard-apl)

---- Known issues:

Test kms_atomic_transition:
        Subgroup 1x-modeset-transitions-fencing:
                pass       -> FAIL       (shard-apl) fdo#103207
Test kms_chv_cursor_fail:
        Subgroup pipe-b-256x256-left-edge:
                pass       -> DMESG-WARN (shard-snb) fdo#105185 +2
Test kms_flip:
        Subgroup flip-vs-expired-vblank:
                pass       -> FAIL       (shard-apl) fdo#102887
        Subgroup plain-flip-fb-recreate-interruptible:
                fail       -> PASS       (shard-hsw) fdo#100368 +1
Test kms_frontbuffer_tracking:
        Subgroup fbc-suspend:
                pass       -> FAIL       (shard-apl) fdo#101623
Test perf:
        Subgroup polling:
                fail       -> PASS       (shard-hsw) fdo#102252 +1
Test pm_lpsp:
        Subgroup screens-disabled:
                fail       -> PASS       (shard-hsw) fdo#104941

fdo#103207 https://bugs.freedesktop.org/show_bug.cgi?id=103207
fdo#105185 https://bugs.freedesktop.org/show_bug.cgi?id=105185
fdo#102887 https://bugs.freedesktop.org/show_bug.cgi?id=102887
fdo#100368 https://bugs.freedesktop.org/show_bug.cgi?id=100368
fdo#101623 https://bugs.freedesktop.org/show_bug.cgi?id=101623
fdo#102252 https://bugs.freedesktop.org/show_bug.cgi?id=102252
fdo#104941 https://bugs.freedesktop.org/show_bug.cgi?id=104941

shard-apl        total:3467 pass:1814 dwarn:1   dfail:0   fail:19  skip:1632 time:12279s
shard-hsw        total:3467 pass:1773 dwarn:1   dfail:0   fail:1   skip:1691 time:11930s
shard-snb        total:3467 pass:1359 dwarn:5   dfail:0   fail:2   skip:2101 time:6966s
Blacklisted hosts:
shard-kbl        total:3381 pass:1894 dwarn:1   dfail:0   fail:15  skip:1470 time:9110s

Patches download mbox

Tests

Series 38919v9 Add NV12 support
https://patchwork.freedesktop.org/api/1.0/series/38919/revisions/9/mbox/

---- Possible new issues:

Test drv_module_reload:
        Subgroup basic-reload-inject:
                pass       -> INCOMPLETE (fi-elk-e7500)

---- Known issues:

Test kms_pipe_crc_basic:
        Subgroup suspend-read-crc-pipe-b:
                pass       -> INCOMPLETE (fi-snb-2520m) fdo#103713
Test prime_vgem:
        Subgroup basic-fence-flip:
                fail       -> PASS       (fi-ilk-650) fdo#104008

fdo#103713 https://bugs.freedesktop.org/show_bug.cgi?id=103713
fdo#104008 https://bugs.freedesktop.org/show_bug.cgi?id=104008

fi-bdw-5557u     total:288  pass:267  dwarn:0   dfail:0   fail:0   skip:21  time:427s
fi-bdw-gvtdvm    total:288  pass:264  dwarn:0   dfail:0   fail:0   skip:24  time:426s
fi-blb-e6850     total:288  pass:223  dwarn:1   dfail:0   fail:0   skip:64  time:374s
fi-bsw-n3050     total:288  pass:242  dwarn:0   dfail:0   fail:0   skip:46  time:511s
fi-bwr-2160      total:288  pass:183  dwarn:0   dfail:0   fail:0   skip:105 time:279s
fi-bxt-j4205     total:288  pass:259  dwarn:0   dfail:0   fail:0   skip:29  time:491s
fi-byt-j1900     total:288  pass:253  dwarn:0   dfail:0   fail:0   skip:35  time:486s
fi-byt-n2820     total:288  pass:249  dwarn:0   dfail:0   fail:0   skip:39  time:475s
fi-cfl-8700k     total:288  pass:260  dwarn:0   dfail:0   fail:0   skip:28  time:405s
fi-cfl-s2        total:288  pass:262  dwarn:0   dfail:0   fail:0   skip:26  time:579s
fi-cfl-u         total:288  pass:262  dwarn:0   dfail:0   fail:0   skip:26  time:507s
fi-elk-e7500     total:287  pass:228  dwarn:0   dfail:0   fail:0   skip:58 
fi-gdg-551       total:288  pass:179  dwarn:0   dfail:0   fail:1   skip:108 time:294s
fi-glk-1         total:288  pass:260  dwarn:0   dfail:0   fail:0   skip:28  time:518s
fi-hsw-4770      total:288  pass:261  dwarn:0   dfail:0   fail:0   skip:27  time:398s
fi-ilk-650       total:288  pass:228  dwarn:0   dfail:0   fail:0   skip:60  time:411s
fi-ivb-3520m     total:288  pass:259  dwarn:0   dfail:0   fail:0   skip:29  time:466s
fi-ivb-3770      total:288  pass:255  dwarn:0   dfail:0   fail:0   skip:33  time:418s
fi-kbl-7500u     total:288  pass:263  dwarn:1   dfail:0   fail:0   skip:24  time:469s
fi-kbl-7567u     total:288  pass:268  dwarn:0   dfail:0   fail:0   skip:20  time:463s
fi-kbl-r         total:288  pass:261  dwarn:0   dfail:0   fail:0   skip:27  time:508s
fi-pnv-d510      total:288  pass:222  dwarn:1   dfail:0   fail:0   skip:65  time:587s
fi-skl-6260u     total:288  pass:268  dwarn:0   dfail:0   fail:0   skip:20  time:432s
fi-skl-6600u     total:288  pass:261  dwarn:0   dfail:0   fail:0   skip:27  time:524s
fi-skl-6700hq    total:288  pass:262  dwarn:0   dfail:0   fail:0   skip:26  time:532s
fi-skl-6700k2    total:288  pass:264  dwarn:0   dfail:0   fail:0   skip:24  time:499s
fi-skl-6770hq    total:288  pass:268  dwarn:0   dfail:0   fail:0   skip:20  time:487s
fi-skl-guc       total:288  pass:260  dwarn:0   dfail:0   fail:0   skip:28  time:423s
fi-skl-gvtdvm    total:288  pass:265  dwarn:0   dfail:0   fail:0   skip:23  time:431s
fi-snb-2520m     total:245  pass:211  dwarn:0   dfail:0   fail:0   skip:33 
fi-snb-2600      total:288  pass:248  dwarn:0   dfail:0   fail:0   skip:40  time:392s

8a4eb4556f66d7ab7ad512d5c3d239da8de6b750 drm-tip: 2018y-03m-06d-22h-59m-29s UTC integration manifest
8e00ad26da01 drm/i915: Display WA 827
718d0458dcc2 drm/i915: Enable YUV to RGB for Gen10 in Plane Ctrl Reg
9804f9e47c7e drm/i915: Add NV12 support to intel_framebuffer_init
5a20547fface drm/i915: Add NV12 as supported format for sprite plane
f6687087989c drm/i915: Add NV12 as supported format for primary plane
16c81e2fe5e1 drm/i915: Upscale scaler max scale for NV12
f84b94b64aec drm/i915: Update format_is_yuv() to include NV12
67025fde39c5 drm/i915: Set scaler mode for NV12
1e9d7bf3bb79 drm/i915/skl: split skl_compute_ddb function
9b0a9f9629b5 drm/i915/skl+: nv12 workaround disable WM level 1-7
801e39317f2c drm/i915/skl+: make sure higher latency level has higher wm value
7242d6a98af7 drm/i915/skl+: pass skl_wm_level struct to wm compute func
4f3449ba1877 drm/i915/skl+: NV12 related changes for WM
5d42dc7c784a drm/i915/skl+: support verification of DDB HW state for NV12
0e1253d75583 drm/i915/skl+: add NV12 in skl_format_to_fourcc
8e038be6103e drm/i915/skl+: refactor WM calculation for NV12
1e92cad41289 drm/i915/skl+: rename skl_wm_values struct to skl_ddb_values

Patches download mbox

Tests

Series 38919v10 Add NV12 support
https://patchwork.freedesktop.org/api/1.0/series/38919/revisions/10/mbox/

---- Possible new issues:

Test kms_force_connector_basic:
        Subgroup force-connector-state:
                pass       -> SKIP       (fi-snb-2520m)
        Subgroup force-edid:
                pass       -> SKIP       (fi-snb-2520m)
        Subgroup force-load-detect:
                pass       -> SKIP       (fi-snb-2520m)
        Subgroup prune-stale-modes:
                pass       -> SKIP       (fi-snb-2520m)

fi-bdw-5557u     total:288  pass:267  dwarn:0   dfail:0   fail:0   skip:21  time:424s
fi-bdw-gvtdvm    total:288  pass:264  dwarn:0   dfail:0   fail:0   skip:24  time:421s
fi-blb-e6850     total:288  pass:223  dwarn:1   dfail:0   fail:0   skip:64  time:370s
fi-bsw-n3050     total:288  pass:242  dwarn:0   dfail:0   fail:0   skip:46  time:504s
fi-bwr-2160      total:288  pass:183  dwarn:0   dfail:0   fail:0   skip:105 time:277s
fi-bxt-dsi       total:288  pass:258  dwarn:0   dfail:0   fail:0   skip:30  time:489s
fi-bxt-j4205     total:288  pass:259  dwarn:0   dfail:0   fail:0   skip:29  time:492s
fi-byt-j1900     total:288  pass:253  dwarn:0   dfail:0   fail:0   skip:35  time:477s
fi-byt-n2820     total:288  pass:249  dwarn:0   dfail:0   fail:0   skip:39  time:473s
fi-cfl-8700k     total:288  pass:260  dwarn:0   dfail:0   fail:0   skip:28  time:401s
fi-cfl-s2        total:288  pass:262  dwarn:0   dfail:0   fail:0   skip:26  time:579s
fi-cfl-u         total:288  pass:262  dwarn:0   dfail:0   fail:0   skip:26  time:504s
fi-elk-e7500     total:288  pass:229  dwarn:0   dfail:0   fail:0   skip:59  time:416s
fi-gdg-551       total:288  pass:179  dwarn:0   dfail:0   fail:1   skip:108 time:290s
fi-glk-1         total:288  pass:260  dwarn:0   dfail:0   fail:0   skip:28  time:515s
fi-hsw-4770      total:288  pass:261  dwarn:0   dfail:0   fail:0   skip:27  time:396s
fi-ilk-650       total:288  pass:228  dwarn:0   dfail:0   fail:0   skip:60  time:410s
fi-ivb-3520m     total:288  pass:259  dwarn:0   dfail:0   fail:0   skip:29  time:464s
fi-ivb-3770      total:288  pass:255  dwarn:0   dfail:0   fail:0   skip:33  time:418s
fi-kbl-7500u     total:288  pass:263  dwarn:1   dfail:0   fail:0   skip:24  time:467s
fi-kbl-7567u     total:288  pass:268  dwarn:0   dfail:0   fail:0   skip:20  time:466s
fi-kbl-r         total:288  pass:261  dwarn:0   dfail:0   fail:0   skip:27  time:509s
fi-pnv-d510      total:288  pass:222  dwarn:1   dfail:0   fail:0   skip:65  time:587s
fi-skl-6260u     total:288  pass:268  dwarn:0   dfail:0   fail:0   skip:20  time:432s
fi-skl-6600u     total:288  pass:261  dwarn:0   dfail:0   fail:0   skip:27  time:522s
fi-skl-6700hq    total:288  pass:262  dwarn:0   dfail:0   fail:0   skip:26  time:535s
fi-skl-6700k2    total:288  pass:264  dwarn:0   dfail:0   fail:0   skip:24  time:500s
fi-skl-6770hq    total:288  pass:268  dwarn:0   dfail:0   fail:0   skip:20  time:490s
fi-skl-guc       total:288  pass:260  dwarn:0   dfail:0   fail:0   skip:28  time:421s
fi-skl-gvtdvm    total:288  pass:265  dwarn:0   dfail:0   fail:0   skip:23  time:430s
fi-snb-2520m     total:288  pass:244  dwarn:0   dfail:0   fail:0   skip:44  time:518s
fi-snb-2600      total:288  pass:248  dwarn:0   dfail:0   fail:0   skip:40  time:397s

fc93d196b8e428bc5a186bde78f412aa30081f38 drm-tip: 2018y-03m-07d-23h-55m-21s UTC integration manifest
e3c2d5a2ed02 drm/i915: Display WA 827
ea6ca16a394c drm/i915: Enable YUV to RGB for Gen10 in Plane Ctrl Reg
3b64a7e6b94e drm/i915: Add NV12 support to intel_framebuffer_init
f177cde7ab8d drm/i915: Add NV12 as supported format for sprite plane
266a190c8535 drm/i915: Add NV12 as supported format for primary plane
ef9968e69974 drm/i915: Upscale scaler max scale for NV12
1ddd2e095b21 drm/i915: Update format_is_yuv() to include NV12
a396c34ce112 drm/i915: Set scaler mode for NV12
a124a6c6e8f8 drm/i915/skl: split skl_compute_ddb function
f561927610c3 drm/i915/skl+: nv12 workaround disable WM level 1-7
75b9346b0d23 drm/i915/skl+: make sure higher latency level has higher wm value
279d307c6ee3 drm/i915/skl+: pass skl_wm_level struct to wm compute func
6067f0dd69dc drm/i915/skl+: NV12 related changes for WM
5ab873748a86 drm/i915/skl+: support verification of DDB HW state for NV12
9506e78aa0fb drm/i915/skl+: add NV12 in skl_format_to_fourcc
c77f1e667005 drm/i915/skl+: refactor WM calculation for NV12
3012dc80f0b0 drm/i915/skl+: rename skl_wm_values struct to skl_ddb_values

Patches download mbox

Tests

Series 38919v11 Add NV12 support
https://patchwork.freedesktop.org/api/1.0/series/38919/revisions/11/mbox/

---- Known issues:

Test kms_pipe_crc_basic:
        Subgroup suspend-read-crc-pipe-b:
                pass       -> INCOMPLETE (fi-snb-2520m) fdo#103713
        Subgroup suspend-read-crc-pipe-c:
                pass       -> FAIL       (fi-skl-guc) fdo#103191

fdo#103713 https://bugs.freedesktop.org/show_bug.cgi?id=103713
fdo#103191 https://bugs.freedesktop.org/show_bug.cgi?id=103191

fi-bdw-5557u     total:288  pass:267  dwarn:0   dfail:0   fail:0   skip:21  time:422s
fi-bdw-gvtdvm    total:288  pass:264  dwarn:0   dfail:0   fail:0   skip:24  time:425s
fi-blb-e6850     total:288  pass:223  dwarn:1   dfail:0   fail:0   skip:64  time:370s
fi-bsw-n3050     total:288  pass:242  dwarn:0   dfail:0   fail:0   skip:46  time:497s
fi-bwr-2160      total:288  pass:183  dwarn:0   dfail:0   fail:0   skip:105 time:278s
fi-bxt-dsi       total:288  pass:258  dwarn:0   dfail:0   fail:0   skip:30  time:487s
fi-bxt-j4205     total:288  pass:259  dwarn:0   dfail:0   fail:0   skip:29  time:492s
fi-byt-j1900     total:288  pass:253  dwarn:0   dfail:0   fail:0   skip:35  time:480s
fi-byt-n2820     total:288  pass:249  dwarn:0   dfail:0   fail:0   skip:39  time:469s
fi-cfl-8700k     total:288  pass:260  dwarn:0   dfail:0   fail:0   skip:28  time:408s
fi-cfl-s2        total:288  pass:262  dwarn:0   dfail:0   fail:0   skip:26  time:578s
fi-cfl-u         total:288  pass:262  dwarn:0   dfail:0   fail:0   skip:26  time:505s
fi-elk-e7500     total:288  pass:229  dwarn:0   dfail:0   fail:0   skip:59  time:408s
fi-gdg-551       total:288  pass:179  dwarn:0   dfail:0   fail:1   skip:108 time:289s
fi-glk-1         total:288  pass:260  dwarn:0   dfail:0   fail:0   skip:28  time:517s
fi-hsw-4770      total:288  pass:261  dwarn:0   dfail:0   fail:0   skip:27  time:396s
fi-ilk-650       total:288  pass:228  dwarn:0   dfail:0   fail:0   skip:60  time:406s
fi-ivb-3520m     total:288  pass:259  dwarn:0   dfail:0   fail:0   skip:29  time:457s
fi-ivb-3770      total:288  pass:255  dwarn:0   dfail:0   fail:0   skip:33  time:419s
fi-kbl-7500u     total:288  pass:263  dwarn:1   dfail:0   fail:0   skip:24  time:469s
fi-kbl-7567u     total:288  pass:268  dwarn:0   dfail:0   fail:0   skip:20  time:463s
fi-kbl-r         total:288  pass:261  dwarn:0   dfail:0   fail:0   skip:27  time:505s
fi-pnv-d510      total:288  pass:222  dwarn:1   dfail:0   fail:0   skip:65  time:584s
fi-skl-6260u     total:288  pass:268  dwarn:0   dfail:0   fail:0   skip:20  time:443s
fi-skl-6600u     total:288  pass:261  dwarn:0   dfail:0   fail:0   skip:27  time:525s
fi-skl-6700hq    total:288  pass:262  dwarn:0   dfail:0   fail:0   skip:26  time:532s
fi-skl-6700k2    total:288  pass:264  dwarn:0   dfail:0   fail:0   skip:24  time:503s
fi-skl-6770hq    total:288  pass:268  dwarn:0   dfail:0   fail:0   skip:20  time:482s
fi-skl-guc       total:288  pass:259  dwarn:0   dfail:0   fail:1   skip:28  time:423s
fi-skl-gvtdvm    total:288  pass:265  dwarn:0   dfail:0   fail:0   skip:23  time:428s
fi-snb-2520m     total:245  pass:211  dwarn:0   dfail:0   fail:0   skip:33 
fi-snb-2600      total:288  pass:248  dwarn:0   dfail:0   fail:0   skip:40  time:388s

fc93d196b8e428bc5a186bde78f412aa30081f38 drm-tip: 2018y-03m-07d-23h-55m-21s UTC integration manifest
cec88e9800c1 drm/i915: Display WA 827
5831a781723a drm/i915: Enable YUV to RGB for Gen10 in Plane Ctrl Reg
5d56c224e509 drm/i915: Add NV12 support to intel_framebuffer_init
a68e0c036caa drm/i915: Add NV12 as supported format for sprite plane
3de98ac3b15a drm/i915: Add NV12 as supported format for primary plane
dfe89f7d1f87 drm/i915: Upscale scaler max scale for NV12
6642960b40e6 drm/i915: Update format_is_yuv() to include NV12
75e224999b46 drm/i915: Set scaler mode for NV12
627d49d8cd89 drm/i915/skl: split skl_compute_ddb function
f24abd707724 drm/i915/skl+: nv12 workaround disable WM level 1-7
46b5d3606fe5 drm/i915/skl+: make sure higher latency level has higher wm value
9f854e3bf8cd drm/i915/skl+: pass skl_wm_level struct to wm compute func
2a5860171028 drm/i915/skl+: NV12 related changes for WM
ecc47c87c306 drm/i915/skl+: support verification of DDB HW state for NV12
129a74cae448 drm/i915/skl+: add NV12 in skl_format_to_fourcc
91f64378aa45 drm/i915/skl+: refactor WM calculation for NV12
714bd27664e2 drm/i915/skl+: rename skl_wm_values struct to skl_ddb_values
---- Possible new issues:

Test kms_chv_cursor_fail:
        Subgroup pipe-c-256x256-left-edge:
                pass       -> INCOMPLETE (shard-hsw)
Test kms_plane_scaling:
        Subgroup pipe-a-scaler-with-rotation:
                pass       -> DMESG-WARN (shard-apl)
        Subgroup pipe-b-scaler-with-rotation:
                pass       -> DMESG-WARN (shard-apl)

---- Known issues:

Test gem_eio:
        Subgroup in-flight-contexts:
                incomplete -> PASS       (shard-apl) fdo#105341
Test kms_chv_cursor_fail:
        Subgroup pipe-b-256x256-bottom-edge:
                dmesg-warn -> PASS       (shard-snb) fdo#105185 +2
Test kms_flip:
        Subgroup 2x-plain-flip-ts-check:
                fail       -> PASS       (shard-hsw) fdo#100368 +1
Test kms_frontbuffer_tracking:
        Subgroup fbc-1p-primscrn-spr-indfb-draw-render:
                pass       -> FAIL       (shard-apl) fdo#103167

fdo#105341 https://bugs.freedesktop.org/show_bug.cgi?id=105341
fdo#105185 https://bugs.freedesktop.org/show_bug.cgi?id=105185
fdo#100368 https://bugs.freedesktop.org/show_bug.cgi?id=100368
fdo#103167 https://bugs.freedesktop.org/show_bug.cgi?id=103167

shard-apl        total:3467 pass:1822 dwarn:3   dfail:0   fail:9   skip:1632 time:12307s
shard-hsw        total:3406 pass:1743 dwarn:1   dfail:0   fail:2   skip:1658 time:11762s
shard-snb        total:3467 pass:1362 dwarn:2   dfail:0   fail:2   skip:2101 time:7053s
Blacklisted hosts:
shard-kbl        total:3381 pass:1899 dwarn:4   dfail:0   fail:8   skip:1469 time:9192s

Patches download mbox

Tests

Series 38919v12 Add NV12 support
https://patchwork.freedesktop.org/api/1.0/series/38919/revisions/12/mbox/

---- Known issues:

Test gem_exec_suspend:
        Subgroup basic-s3:
                pass       -> INCOMPLETE (fi-elk-e7500) fdo#103989
Test gem_mmap_gtt:
        Subgroup basic-small-bo-tiledx:
                fail       -> PASS       (fi-gdg-551) fdo#102575

fdo#103989 https://bugs.freedesktop.org/show_bug.cgi?id=103989
fdo#102575 https://bugs.freedesktop.org/show_bug.cgi?id=102575

fi-bdw-5557u     total:288  pass:267  dwarn:0   dfail:0   fail:0   skip:21  time:422s
fi-blb-e6850     total:288  pass:223  dwarn:1   dfail:0   fail:0   skip:64  time:375s
fi-bsw-n3050     total:288  pass:242  dwarn:0   dfail:0   fail:0   skip:46  time:497s
fi-bwr-2160      total:288  pass:183  dwarn:0   dfail:0   fail:0   skip:105 time:279s
fi-bxt-dsi       total:288  pass:258  dwarn:0   dfail:0   fail:0   skip:30  time:488s
fi-bxt-j4205     total:288  pass:259  dwarn:0   dfail:0   fail:0   skip:29  time:491s
fi-byt-j1900     total:288  pass:253  dwarn:0   dfail:0   fail:0   skip:35  time:477s
fi-byt-n2820     total:288  pass:249  dwarn:0   dfail:0   fail:0   skip:39  time:467s
fi-cfl-8700k     total:288  pass:260  dwarn:0   dfail:0   fail:0   skip:28  time:407s
fi-cfl-s2        total:288  pass:262  dwarn:0   dfail:0   fail:0   skip:26  time:573s
fi-cfl-u         total:288  pass:262  dwarn:0   dfail:0   fail:0   skip:26  time:504s
fi-elk-e7500     total:108  pass:81   dwarn:0   dfail:0   fail:0   skip:26 
fi-gdg-551       total:288  pass:180  dwarn:0   dfail:0   fail:0   skip:108 time:288s
fi-glk-1         total:288  pass:260  dwarn:0   dfail:0   fail:0   skip:28  time:516s
fi-hsw-4770      total:288  pass:261  dwarn:0   dfail:0   fail:0   skip:27  time:402s
fi-ilk-650       total:288  pass:228  dwarn:0   dfail:0   fail:0   skip:60  time:410s
fi-ivb-3520m     total:288  pass:259  dwarn:0   dfail:0   fail:0   skip:29  time:465s
fi-ivb-3770      total:288  pass:255  dwarn:0   dfail:0   fail:0   skip:33  time:417s
fi-kbl-7500u     total:288  pass:263  dwarn:1   dfail:0   fail:0   skip:24  time:467s
fi-kbl-7567u     total:288  pass:268  dwarn:0   dfail:0   fail:0   skip:20  time:462s
fi-kbl-r         total:288  pass:261  dwarn:0   dfail:0   fail:0   skip:27  time:510s
fi-pnv-d510      total:288  pass:222  dwarn:1   dfail:0   fail:0   skip:65  time:588s
fi-skl-6260u     total:288  pass:268  dwarn:0   dfail:0   fail:0   skip:20  time:430s
fi-skl-6600u     total:288  pass:261  dwarn:0   dfail:0   fail:0   skip:27  time:520s
fi-skl-6700hq    total:288  pass:262  dwarn:0   dfail:0   fail:0   skip:26  time:546s
fi-skl-6700k2    total:288  pass:264  dwarn:0   dfail:0   fail:0   skip:24  time:495s
fi-skl-6770hq    total:288  pass:268  dwarn:0   dfail:0   fail:0   skip:20  time:487s
fi-skl-guc       total:288  pass:260  dwarn:0   dfail:0   fail:0   skip:28  time:423s
fi-skl-gvtdvm    total:288  pass:265  dwarn:0   dfail:0   fail:0   skip:23  time:429s
fi-snb-2520m     total:288  pass:248  dwarn:0   dfail:0   fail:0   skip:40  time:519s
fi-snb-2600      total:288  pass:248  dwarn:0   dfail:0   fail:0   skip:40  time:394s

fc93d196b8e428bc5a186bde78f412aa30081f38 drm-tip: 2018y-03m-07d-23h-55m-21s UTC integration manifest
656641749b89 drm/i915: Display WA 827
0bec9e33b9fa drm/i915: Enable YUV to RGB for Gen10 in Plane Ctrl Reg
d69ad80b91d9 drm/i915: Add NV12 support to intel_framebuffer_init
0fd29a3d02dc drm/i915: Add NV12 as supported format for sprite plane
2bc82f26e303 drm/i915: Add NV12 as supported format for primary plane
7dbf5ac10b26 drm/i915: Upscale scaler max scale for NV12
ed299ef938cf drm/i915: Update format_is_yuv() to include NV12
a5f39ada13b9 drm/i915: Set scaler mode for NV12
e5f22bd7e566 drm/i915/skl: split skl_compute_ddb function
53144a4c6806 drm/i915/skl+: nv12 workaround disable WM level 1-7
f584c7c4a583 drm/i915/skl+: make sure higher latency level has higher wm value
056fbc7f449a drm/i915/skl+: pass skl_wm_level struct to wm compute func
3f29c0705ed7 drm/i915/skl+: NV12 related changes for WM
63ef697ed80c drm/i915/skl+: support verification of DDB HW state for NV12
2d55bb4ae902 drm/i915/skl+: add NV12 in skl_format_to_fourcc
3e06268486e6 drm/i915/skl+: refactor WM calculation for NV12
f60daff66d7a drm/i915/skl+: rename skl_wm_values struct to skl_ddb_values
---- Possible new issues:

Test kms_atomic_transition:
        Subgroup plane-all-modeset-transition:
                pass       -> DMESG-WARN (shard-hsw)
Test kms_plane_scaling:
        Subgroup pipe-a-scaler-with-pixel-format:
                pass       -> FAIL       (shard-apl)
        Subgroup pipe-a-scaler-with-rotation:
                pass       -> FAIL       (shard-apl)
        Subgroup pipe-b-scaler-with-pixel-format:
                pass       -> FAIL       (shard-apl)
        Subgroup pipe-b-scaler-with-rotation:
                pass       -> FAIL       (shard-apl)

---- Known issues:

Test kms_atomic_transition:
        Subgroup 1x-modeset-transitions-nonblocking:
                pass       -> FAIL       (shard-apl) fdo#103207
Test kms_chv_cursor_fail:
        Subgroup pipe-b-64x64-top-edge:
                dmesg-warn -> PASS       (shard-snb) fdo#105185 +3
Test kms_cursor_legacy:
        Subgroup flip-vs-cursor-toggle:
                pass       -> FAIL       (shard-hsw) fdo#102670
Test kms_flip:
        Subgroup 2x-dpms-vs-vblank-race:
                pass       -> FAIL       (shard-hsw) fdo#103060
        Subgroup 2x-plain-flip-ts-check:
                fail       -> PASS       (shard-hsw) fdo#100368 +1
        Subgroup flip-vs-expired-vblank:
                pass       -> FAIL       (shard-hsw) fdo#102887
Test pm_lpsp:
        Subgroup screens-disabled:
                fail       -> PASS       (shard-hsw) fdo#104941

fdo#103207 https://bugs.freedesktop.org/show_bug.cgi?id=103207
fdo#105185 https://bugs.freedesktop.org/show_bug.cgi?id=105185
fdo#102670 https://bugs.freedesktop.org/show_bug.cgi?id=102670
fdo#103060 https://bugs.freedesktop.org/show_bug.cgi?id=103060
fdo#100368 https://bugs.freedesktop.org/show_bug.cgi?id=100368
fdo#102887 https://bugs.freedesktop.org/show_bug.cgi?id=102887
fdo#104941 https://bugs.freedesktop.org/show_bug.cgi?id=104941

shard-apl        total:3343 pass:1756 dwarn:1   dfail:0   fail:12  skip:1571 time:11260s
shard-hsw        total:3467 pass:1769 dwarn:2   dfail:0   fail:4   skip:1691 time:11882s
shard-snb        total:3467 pass:1361 dwarn:3   dfail:0   fail:2   skip:2101 time:6989s
Blacklisted hosts:
shard-kbl        total:3381 pass:1879 dwarn:15  dfail:2   fail:11  skip:1473 time:9183s

Patches download mbox

Tests

Series 38919v13 Add NV12 support
https://patchwork.freedesktop.org/api/1.0/series/38919/revisions/13/mbox/

fi-bdw-5557u     total:285  pass:264  dwarn:0   dfail:0   fail:0   skip:21  time:432s
fi-bdw-gvtdvm    total:285  pass:261  dwarn:0   dfail:0   fail:0   skip:24  time:445s
fi-blb-e6850     total:285  pass:220  dwarn:1   dfail:0   fail:0   skip:64  time:385s
fi-bsw-n3050     total:285  pass:239  dwarn:0   dfail:0   fail:0   skip:46  time:535s
fi-bwr-2160      total:285  pass:180  dwarn:0   dfail:0   fail:0   skip:105 time:299s
fi-bxt-dsi       total:285  pass:255  dwarn:0   dfail:0   fail:0   skip:30  time:514s
fi-byt-j1900     total:285  pass:250  dwarn:0   dfail:0   fail:0   skip:35  time:517s
fi-byt-n2820     total:285  pass:246  dwarn:0   dfail:0   fail:0   skip:39  time:506s
fi-cfl-8700k     total:285  pass:257  dwarn:0   dfail:0   fail:0   skip:28  time:410s
fi-cfl-s2        total:285  pass:259  dwarn:0   dfail:0   fail:0   skip:26  time:578s
fi-cfl-u         total:285  pass:259  dwarn:0   dfail:0   fail:0   skip:26  time:512s
fi-cnl-y3        total:285  pass:259  dwarn:0   dfail:0   fail:0   skip:26  time:585s
fi-elk-e7500     total:285  pass:226  dwarn:0   dfail:0   fail:0   skip:59  time:427s
fi-gdg-551       total:285  pass:176  dwarn:0   dfail:0   fail:1   skip:108 time:316s
fi-glk-1         total:285  pass:257  dwarn:0   dfail:0   fail:0   skip:28  time:539s
fi-hsw-4770      total:285  pass:258  dwarn:0   dfail:0   fail:0   skip:27  time:405s
fi-ilk-650       total:285  pass:225  dwarn:0   dfail:0   fail:0   skip:60  time:424s
fi-ivb-3520m     total:285  pass:256  dwarn:0   dfail:0   fail:0   skip:29  time:474s
fi-ivb-3770      total:285  pass:252  dwarn:0   dfail:0   fail:0   skip:33  time:432s
fi-kbl-7500u     total:285  pass:260  dwarn:1   dfail:0   fail:0   skip:24  time:473s
fi-kbl-7567u     total:285  pass:265  dwarn:0   dfail:0   fail:0   skip:20  time:469s
fi-kbl-r         total:285  pass:258  dwarn:0   dfail:0   fail:0   skip:27  time:514s
fi-pnv-d510      total:285  pass:219  dwarn:1   dfail:0   fail:0   skip:65  time:661s
fi-skl-6260u     total:285  pass:265  dwarn:0   dfail:0   fail:0   skip:20  time:442s
fi-skl-6600u     total:285  pass:258  dwarn:0   dfail:0   fail:0   skip:27  time:530s
fi-skl-6700hq    total:285  pass:259  dwarn:0   dfail:0   fail:0   skip:26  time:541s
fi-skl-6700k2    total:285  pass:261  dwarn:0   dfail:0   fail:0   skip:24  time:509s
fi-skl-6770hq    total:285  pass:265  dwarn:0   dfail:0   fail:0   skip:20  time:498s
fi-skl-guc       total:285  pass:257  dwarn:0   dfail:0   fail:0   skip:28  time:428s
fi-skl-gvtdvm    total:285  pass:262  dwarn:0   dfail:0   fail:0   skip:23  time:449s
fi-snb-2520m     total:285  pass:245  dwarn:0   dfail:0   fail:0   skip:40  time:568s
fi-snb-2600      total:285  pass:245  dwarn:0   dfail:0   fail:0   skip:40  time:402s
Blacklisted hosts:
fi-cnl-drrs      total:285  pass:254  dwarn:3   dfail:0   fail:0   skip:28  time:534s

178cfb9373cc2bdfcb6ca73e03369d2c37cc4b58 drm-tip: 2018y-03m-14d-21h-38m-09s UTC integration manifest
6ae6fd61038a drm/i915: Display WA 827
e477074e571d drm/i915: Enable YUV to RGB for Gen10 in Plane Ctrl Reg
d9f99632b9d0 drm/i915: Add NV12 support to intel_framebuffer_init
90fd8d154195 drm/i915: Add NV12 as supported format for sprite plane
6355394c2c0d drm/i915: Add NV12 as supported format for primary plane
ecd7d880be03 drm/i915: Upscale scaler max scale for NV12
7fe5b6ee60c9 drm/i915: Update format_is_yuv() to include NV12
b21083eba5e3 drm/i915: Set scaler mode for NV12
f4d1dd9e39f2 drm/i915/skl: split skl_compute_ddb function
39c751b094a0 drm/i915/skl+: nv12 workaround disable WM level 1-7
9d723384efe7 drm/i915/skl+: make sure higher latency level has higher wm value
a946241323df drm/i915/skl+: pass skl_wm_level struct to wm compute func
3a94945b3ecd drm/i915/skl+: NV12 related changes for WM
4be2dd5b81d5 drm/i915/skl+: support verification of DDB HW state for NV12
b2402c1ffb3d drm/i915/skl+: add NV12 in skl_format_to_fourcc
a6d479234276 drm/i915/skl+: refactor WM calculation for NV12
50f7bcb08477 drm/i915/skl+: rename skl_wm_values struct to skl_ddb_values
---- Possible new issues:

Test kms_frontbuffer_tracking:
        Subgroup fbc-1p-primscrn-pri-shrfb-draw-render:
                fail       -> PASS       (shard-apl)
Test kms_plane_scaling:
        Subgroup pipe-a-scaler-with-pixel-format:
                pass       -> FAIL       (shard-apl)
        Subgroup pipe-a-scaler-with-rotation:
                pass       -> FAIL       (shard-apl)
        Subgroup pipe-b-scaler-with-pixel-format:
                pass       -> FAIL       (shard-apl)
        Subgroup pipe-b-scaler-with-rotation:
                pass       -> FAIL       (shard-apl)
Test kms_vblank:
        Subgroup pipe-b-accuracy-idle:
                pass       -> SKIP       (shard-snb)

---- Known issues:

Test kms_chv_cursor_fail:
        Subgroup pipe-b-128x128-bottom-edge:
                pass       -> SKIP       (shard-snb) fdo#105185
Test kms_flip:
        Subgroup flip-vs-expired-vblank-interruptible:
                fail       -> PASS       (shard-hsw) fdo#102887
Test kms_frontbuffer_tracking:
        Subgroup fbc-1p-primscrn-spr-indfb-draw-mmap-cpu:
                pass       -> SKIP       (shard-snb) fdo#103167

fdo#105185 https://bugs.freedesktop.org/show_bug.cgi?id=105185
fdo#102887 https://bugs.freedesktop.org/show_bug.cgi?id=102887
fdo#103167 https://bugs.freedesktop.org/show_bug.cgi?id=103167

shard-apl        total:3406 pass:1797 dwarn:1   dfail:0   fail:11  skip:1595 time:12608s
shard-hsw        total:3441 pass:1767 dwarn:1   dfail:0   fail:1   skip:1671 time:11812s
shard-snb        total:3441 pass:1354 dwarn:1   dfail:0   fail:2   skip:2084 time:7216s
Blacklisted hosts:
shard-kbl        total:3366 pass:1876 dwarn:21  dfail:1   fail:12  skip:1454 time:9345s

Patches download mbox

Tests

Series 38919v14 Add NV12 support
https://patchwork.freedesktop.org/api/1.0/series/38919/revisions/14/mbox/

---- Possible new issues:

Test drv_module_reload:
        Subgroup basic-no-display:
                pass       -> DMESG-WARN (fi-bdw-5557u)
                pass       -> DMESG-WARN (fi-bdw-gvtdvm)
                pass       -> DMESG-WARN (fi-bxt-dsi)
                pass       -> DMESG-WARN (fi-bxt-j4205)
                pass       -> DMESG-WARN (fi-cfl-8700k)
                pass       -> DMESG-WARN (fi-cfl-s2)
                pass       -> DMESG-WARN (fi-cfl-u)
                pass       -> DMESG-WARN (fi-cnl-y3)
                pass       -> DMESG-WARN (fi-glk-1)
                pass       -> DMESG-WARN (fi-hsw-4770)
                pass       -> DMESG-WARN (fi-kbl-7500u)
                pass       -> DMESG-WARN (fi-kbl-7567u)
                pass       -> DMESG-WARN (fi-kbl-r)
                pass       -> DMESG-WARN (fi-skl-6260u)
                pass       -> DMESG-WARN (fi-skl-6600u)
                pass       -> DMESG-WARN (fi-skl-6700k2)
                pass       -> DMESG-WARN (fi-skl-6770hq)
                pass       -> DMESG-WARN (fi-skl-guc)
                pass       -> DMESG-WARN (fi-skl-gvtdvm)
        Subgroup basic-reload:
                pass       -> DMESG-WARN (fi-bdw-5557u)
                pass       -> DMESG-WARN (fi-bdw-gvtdvm)
                pass       -> DMESG-WARN (fi-bxt-dsi)
                pass       -> DMESG-WARN (fi-bxt-j4205)
                pass       -> DMESG-WARN (fi-cfl-8700k)
                pass       -> DMESG-WARN (fi-cfl-u)
                pass       -> DMESG-WARN (fi-hsw-4770)
                pass       -> DMESG-WARN (fi-kbl-7500u)
                pass       -> DMESG-WARN (fi-kbl-r)
                pass       -> DMESG-WARN (fi-skl-6260u)
                pass       -> DMESG-WARN (fi-skl-6600u)
                pass       -> DMESG-WARN (fi-skl-6700k2)
                pass       -> DMESG-WARN (fi-skl-guc)
                pass       -> DMESG-WARN (fi-skl-gvtdvm)
        Subgroup basic-reload-inject:
                pass       -> DMESG-WARN (fi-bdw-5557u)
                pass       -> DMESG-WARN (fi-bdw-gvtdvm)
                pass       -> DMESG-WARN (fi-bxt-dsi)
                pass       -> DMESG-WARN (fi-bxt-j4205)
                pass       -> DMESG-WARN (fi-cfl-8700k)
                pass       -> DMESG-WARN (fi-cfl-s2)
                pass       -> DMESG-WARN (fi-cfl-u)
                pass       -> DMESG-WARN (fi-cnl-y3)
                pass       -> DMESG-WARN (fi-glk-1)
                pass       -> DMESG-WARN (fi-hsw-4770)
                pass       -> DMESG-WARN (fi-kbl-7500u)
                pass       -> DMESG-WARN (fi-kbl-7567u)
                pass       -> DMESG-WARN (fi-kbl-r)
                pass       -> DMESG-WARN (fi-skl-6260u)
                pass       -> DMESG-WARN (fi-skl-6600u)
                pass       -> DMESG-WARN (fi-skl-6700k2)
                pass       -> DMESG-WARN (fi-skl-6770hq)
                pass       -> DMESG-WARN (fi-skl-guc)
                pass       -> DMESG-WARN (fi-skl-gvtdvm)
Test kms_busy:
        Subgroup basic-flip-c:
                pass       -> DMESG-WARN (fi-bdw-gvtdvm)
                pass       -> DMESG-WARN (fi-bxt-j4205)
                pass       -> DMESG-WARN (fi-cfl-8700k)
                pass       -> DMESG-WARN (fi-cfl-u)
                pass       -> DMESG-WARN (fi-cnl-drrs)
                pass       -> DMESG-WARN (fi-glk-1)
                pass       -> DMESG-WARN (fi-ivb-3520m)
                pass       -> DMESG-WARN (fi-ivb-3770)
                pass       -> DMESG-WARN (fi-kbl-7567u)
                pass       -> DMESG-WARN (fi-skl-6260u)
                pass       -> DMESG-WARN (fi-skl-gvtdvm)
Test kms_flip:
        Subgroup basic-flip-vs-dpms:
                pass       -> DMESG-WARN (fi-bsw-n3050)
                pass       -> DMESG-WARN (fi-cfl-s2)
                pass       -> DMESG-WARN (fi-cnl-y3)
                pass       -> DMESG-WARN (fi-snb-2600)
Test pm_rpm:
        Subgroup basic-pci-d3-state:
                pass       -> DMESG-WARN (fi-bdw-5557u)
                pass       -> DMESG-WARN (fi-byt-n2820)
                pass       -> DMESG-WARN (fi-cnl-drrs)
                pass       -> DMESG-WARN (fi-hsw-4770)
                pass       -> DMESG-WARN (fi-kbl-7567u)
                pass       -> DMESG-WARN (fi-skl-6770hq)
        Subgroup basic-rte:
                pass       -> DMESG-WARN (fi-bxt-j4205)
                pass       -> DMESG-WARN (fi-byt-j1900)
                pass       -> DMESG-WARN (fi-cfl-8700k)
                pass       -> DMESG-WARN (fi-cfl-u)
                pass       -> DMESG-WARN (fi-kbl-7500u)

---- Known issues:

Test debugfs_test:
        Subgroup read_all_entries:
                incomplete -> PASS       (fi-snb-2520m) fdo#103713 +1
WARNING: Long output truncated

b54f7f729d38d6f2773fea4c2a03248d8122e63d drm-tip: 2018y-03m-21d-12h-01m-49s UTC integration manifest
152550bcd33e drm/i915: Disable scaler during plane disable and pre_plane_update
6b610da724b1 drm/i915: Add checks to primary plane
6f26690742c1 drm/i915: Display WA 827
991764f573a0 drm/i915: Enable YUV to RGB for Gen10 in Plane Ctrl Reg
d096bd28c5e1 drm/i915: Add NV12 support to intel_framebuffer_init
06b9b6896f85 drm/i915: Add NV12 as supported format for sprite plane
27d1e2a064ab drm/i915: Add NV12 as supported format for primary plane
fad973c4f25f drm/i915: Upscale scaler max scale for NV12
880b2fa044e2 drm/i915: Update format_is_yuv() to include NV12
35e325cd67b5 drm/i915: Set scaler mode for NV12
d9544244d6b7 drm/i915/skl: split skl_compute_ddb function
59446666197f drm/i915/skl+: nv12 workaround disable WM level 1-7
8fe5de59d0fe drm/i915/skl+: make sure higher latency level has higher wm value
8b0ba65e540b drm/i915/skl+: pass skl_wm_level struct to wm compute func
0472cd6b350c drm/i915/skl+: NV12 related changes for WM
0fcf6e1c5e4b drm/i915/skl+: support verification of DDB HW state for NV12
e961d95a1237 drm/i915/skl+: add NV12 in skl_format_to_fourcc
3bde4b7eb24e drm/i915/skl+: refactor WM calculation for NV12
3ad640a93ff0 drm/i915/skl+: rename skl_wm_values struct to skl_ddb_values

Patches download mbox

Tests

Series 38919v15 Add NV12 support
https://patchwork.freedesktop.org/api/1.0/series/38919/revisions/15/mbox/

---- Possible new issues:

Test drv_module_reload:
        Subgroup basic-no-display:
                pass       -> DMESG-WARN (fi-bdw-5557u)
                pass       -> DMESG-WARN (fi-bdw-gvtdvm)
                pass       -> DMESG-WARN (fi-bxt-dsi)
                pass       -> DMESG-WARN (fi-bxt-j4205)
                pass       -> DMESG-WARN (fi-cfl-8700k)
                pass       -> DMESG-WARN (fi-cfl-s2)
                pass       -> DMESG-WARN (fi-cnl-y3)
                pass       -> DMESG-WARN (fi-glk-1)
                pass       -> DMESG-WARN (fi-hsw-4770)
                pass       -> DMESG-WARN (fi-kbl-7500u)
                pass       -> DMESG-WARN (fi-kbl-7567u)
                pass       -> DMESG-WARN (fi-kbl-r)
                pass       -> DMESG-WARN (fi-skl-6260u)
                pass       -> DMESG-WARN (fi-skl-6600u)
                pass       -> DMESG-WARN (fi-skl-6700k2)
                pass       -> DMESG-WARN (fi-skl-6770hq)
                pass       -> DMESG-WARN (fi-skl-guc)
                pass       -> DMESG-WARN (fi-skl-gvtdvm)
        Subgroup basic-reload:
                pass       -> DMESG-WARN (fi-bdw-5557u)
                pass       -> DMESG-WARN (fi-bdw-gvtdvm)
                pass       -> DMESG-WARN (fi-bxt-dsi)
                pass       -> DMESG-WARN (fi-bxt-j4205)
                pass       -> DMESG-WARN (fi-cfl-8700k)
                pass       -> DMESG-WARN (fi-hsw-4770)
                pass       -> DMESG-WARN (fi-kbl-7500u)
                pass       -> DMESG-WARN (fi-kbl-r)
                pass       -> DMESG-WARN (fi-skl-6260u)
                pass       -> DMESG-WARN (fi-skl-6600u)
                pass       -> DMESG-WARN (fi-skl-6700k2)
                pass       -> DMESG-WARN (fi-skl-guc)
                pass       -> DMESG-WARN (fi-skl-gvtdvm)
        Subgroup basic-reload-inject:
                pass       -> DMESG-WARN (fi-bdw-5557u)
                pass       -> DMESG-WARN (fi-bdw-gvtdvm)
                pass       -> DMESG-WARN (fi-bxt-dsi)
                pass       -> DMESG-WARN (fi-bxt-j4205)
                pass       -> DMESG-WARN (fi-cfl-8700k)
                pass       -> DMESG-WARN (fi-cfl-s2)
                pass       -> DMESG-WARN (fi-cnl-y3)
                pass       -> DMESG-WARN (fi-glk-1)
                pass       -> DMESG-WARN (fi-hsw-4770)
                pass       -> DMESG-WARN (fi-kbl-7500u)
                pass       -> DMESG-WARN (fi-kbl-7567u)
                pass       -> DMESG-WARN (fi-kbl-r)
                pass       -> DMESG-WARN (fi-skl-6260u)
                pass       -> DMESG-WARN (fi-skl-6600u)
                pass       -> DMESG-WARN (fi-skl-6700k2)
                pass       -> DMESG-WARN (fi-skl-6770hq)
                pass       -> DMESG-WARN (fi-skl-guc)
                pass       -> DMESG-WARN (fi-skl-gvtdvm)
Test kms_busy:
        Subgroup basic-flip-c:
                pass       -> DMESG-WARN (fi-bdw-gvtdvm)
                pass       -> DMESG-WARN (fi-bxt-j4205)
                pass       -> DMESG-WARN (fi-cfl-8700k)
                pass       -> DMESG-WARN (fi-cnl-drrs)
                pass       -> DMESG-WARN (fi-glk-1)
                pass       -> DMESG-WARN (fi-ivb-3520m)
                pass       -> DMESG-WARN (fi-ivb-3770)
                pass       -> DMESG-WARN (fi-kbl-7567u)
                pass       -> DMESG-WARN (fi-skl-6260u)
                pass       -> DMESG-WARN (fi-skl-gvtdvm)
Test kms_flip:
        Subgroup basic-flip-vs-dpms:
                pass       -> DMESG-WARN (fi-bsw-n3050)
                pass       -> DMESG-WARN (fi-cfl-s2)
                pass       -> DMESG-WARN (fi-cnl-y3)
                pass       -> DMESG-WARN (fi-snb-2600)
Test pm_rpm:
        Subgroup basic-pci-d3-state:
                pass       -> DMESG-WARN (fi-bdw-5557u)
                pass       -> DMESG-WARN (fi-byt-j1900)
                pass       -> DMESG-WARN (fi-byt-n2820)
                pass       -> DMESG-WARN (fi-cnl-drrs)
                pass       -> DMESG-WARN (fi-hsw-4770)
                pass       -> DMESG-WARN (fi-kbl-7500u)
                pass       -> DMESG-WARN (fi-kbl-7567u)
                pass       -> DMESG-WARN (fi-skl-6260u)
                pass       -> DMESG-WARN (fi-skl-6770hq)
        Subgroup basic-rte:
                pass       -> DMESG-WARN (fi-cfl-8700k)

---- Known issues:

Test debugfs_test:
        Subgroup read_all_entries:
                incomplete -> PASS       (fi-snb-2520m) fdo#103713
Test drv_module_reload:
        Subgroup basic-reload:
                pass       -> DMESG-WARN (fi-kbl-7567u) fdo#105602
                pass       -> DMESG-WARN (fi-skl-6770hq) fdo#104238 +3
Test kms_busy:
WARNING: Long output truncated
fi-cfl-u failed to connect after reboot

dff9ece60048108782aab6d6123822c1d34b0e5a drm-tip: 2018y-03m-21d-20h-44m-14s UTC integration manifest
dd8fe633f435 drm/i915: Disable scaler during plane disable and pre_plane_update
d260a459f276 drm/i915: Add checks to primary plane
332aab310685 drm/i915: Display WA 827
849672126d79 drm/i915: Enable YUV to RGB for Gen10 in Plane Ctrl Reg
47b9b4fa9e0e drm/i915: Add NV12 support to intel_framebuffer_init
a29c483b591c drm/i915: Add NV12 as supported format for sprite plane
115c468d1f4e drm/i915: Add NV12 as supported format for primary plane
867b40879100 drm/i915: Upscale scaler max scale for NV12
660218210e61 drm/i915: Update format_is_yuv() to include NV12
2ec4bec80f11 drm/i915: Set scaler mode for NV12
fe1fd3d335b2 drm/i915/skl: split skl_compute_ddb function
a04fe64ca8ad drm/i915/skl+: nv12 workaround disable WM level 1-7
ae800d6341ee drm/i915/skl+: make sure higher latency level has higher wm value
2f70d20e5456 drm/i915/skl+: pass skl_wm_level struct to wm compute func
90e03e01b29d drm/i915/skl+: NV12 related changes for WM
ed4e24d7c4f9 drm/i915/skl+: support verification of DDB HW state for NV12
1d8b6491843a drm/i915/skl+: add NV12 in skl_format_to_fourcc
cc572270cea0 drm/i915/skl+: refactor WM calculation for NV12
5e75a621550f drm/i915/skl+: rename skl_wm_values struct to skl_ddb_values

Patches download mbox

Tests

Series 38919v16 Add NV12 support
https://patchwork.freedesktop.org/api/1.0/series/38919/revisions/16/mbox/

---- Known issues:

Test debugfs_test:
        Subgroup read_all_entries:
                incomplete -> PASS       (fi-snb-2520m) fdo#103713
Test kms_flip:
        Subgroup basic-flip-vs-wf_vblank:
                fail       -> PASS       (fi-skl-6770hq) fdo#100368

fdo#103713 https://bugs.freedesktop.org/show_bug.cgi?id=103713
fdo#100368 https://bugs.freedesktop.org/show_bug.cgi?id=100368

fi-bdw-5557u     total:285  pass:264  dwarn:0   dfail:0   fail:0   skip:21  time:431s
fi-bdw-gvtdvm    total:285  pass:261  dwarn:0   dfail:0   fail:0   skip:24  time:439s
fi-blb-e6850     total:285  pass:220  dwarn:1   dfail:0   fail:0   skip:64  time:380s
fi-bsw-n3050     total:285  pass:239  dwarn:0   dfail:0   fail:0   skip:46  time:539s
fi-bwr-2160      total:285  pass:180  dwarn:0   dfail:0   fail:0   skip:105 time:300s
fi-bxt-dsi       total:285  pass:255  dwarn:0   dfail:0   fail:0   skip:30  time:514s
fi-bxt-j4205     total:285  pass:256  dwarn:0   dfail:0   fail:0   skip:29  time:513s
fi-byt-j1900     total:285  pass:250  dwarn:0   dfail:0   fail:0   skip:35  time:514s
fi-byt-n2820     total:285  pass:246  dwarn:0   dfail:0   fail:0   skip:39  time:511s
fi-cfl-8700k     total:285  pass:257  dwarn:0   dfail:0   fail:0   skip:28  time:414s
fi-cfl-s2        total:285  pass:259  dwarn:0   dfail:0   fail:0   skip:26  time:565s
fi-cnl-drrs      total:285  pass:254  dwarn:3   dfail:0   fail:0   skip:28  time:531s
fi-cnl-y3        total:285  pass:259  dwarn:0   dfail:0   fail:0   skip:26  time:585s
fi-elk-e7500     total:285  pass:225  dwarn:1   dfail:0   fail:0   skip:59  time:424s
fi-gdg-551       total:285  pass:176  dwarn:0   dfail:0   fail:1   skip:108 time:311s
fi-glk-1         total:285  pass:257  dwarn:0   dfail:0   fail:0   skip:28  time:536s
fi-hsw-4770      total:285  pass:258  dwarn:0   dfail:0   fail:0   skip:27  time:401s
fi-ilk-650       total:285  pass:225  dwarn:0   dfail:0   fail:0   skip:60  time:424s
fi-ivb-3520m     total:285  pass:256  dwarn:0   dfail:0   fail:0   skip:29  time:473s
fi-ivb-3770      total:285  pass:252  dwarn:0   dfail:0   fail:0   skip:33  time:437s
fi-kbl-7500u     total:285  pass:260  dwarn:1   dfail:0   fail:0   skip:24  time:474s
fi-kbl-7567u     total:285  pass:265  dwarn:0   dfail:0   fail:0   skip:20  time:469s
fi-kbl-r         total:285  pass:258  dwarn:0   dfail:0   fail:0   skip:27  time:513s
fi-pnv-d510      total:285  pass:219  dwarn:1   dfail:0   fail:0   skip:65  time:650s
fi-skl-6260u     total:285  pass:265  dwarn:0   dfail:0   fail:0   skip:20  time:437s
fi-skl-6600u     total:285  pass:258  dwarn:0   dfail:0   fail:0   skip:27  time:537s
fi-skl-6700k2    total:285  pass:261  dwarn:0   dfail:0   fail:0   skip:24  time:510s
fi-skl-6770hq    total:285  pass:265  dwarn:0   dfail:0   fail:0   skip:20  time:496s
fi-skl-guc       total:285  pass:257  dwarn:0   dfail:0   fail:0   skip:28  time:426s
fi-skl-gvtdvm    total:285  pass:262  dwarn:0   dfail:0   fail:0   skip:23  time:445s
fi-snb-2520m     total:285  pass:245  dwarn:0   dfail:0   fail:0   skip:40  time:591s
fi-snb-2600      total:285  pass:245  dwarn:0   dfail:0   fail:0   skip:40  time:398s
fi-cfl-u failed to connect after reboot

dff9ece60048108782aab6d6123822c1d34b0e5a drm-tip: 2018y-03m-21d-20h-44m-14s UTC integration manifest
5581d1922dae drm/i915: Add checks to primary plane
5f02a72908e6 drm/i915: Display WA 827
1c4602ac2601 drm/i915: Enable YUV to RGB for Gen10 in Plane Ctrl Reg
120e432e2b97 drm/i915: Add NV12 support to intel_framebuffer_init
7fa2b0765d2e drm/i915: Add NV12 as supported format for sprite plane
41367bc900b1 drm/i915: Add NV12 as supported format for primary plane
717b9d21c6df drm/i915: Upscale scaler max scale for NV12
38b99689e7c9 drm/i915: Update format_is_yuv() to include NV12
15bd2394c5f8 drm/i915: Set scaler mode for NV12
294f186e6029 drm/i915/skl: split skl_compute_ddb function
aa93bda29980 drm/i915/skl+: nv12 workaround disable WM level 1-7
1a6ed25be8ac drm/i915/skl+: make sure higher latency level has higher wm value
a6853b72328b drm/i915/skl+: pass skl_wm_level struct to wm compute func
e0ade5dd3564 drm/i915/skl+: NV12 related changes for WM
c1eb2dcbffe3 drm/i915/skl+: support verification of DDB HW state for NV12
d5b7f0cb62ac drm/i915/skl+: add NV12 in skl_format_to_fourcc
18dc2abe7566 drm/i915/skl+: refactor WM calculation for NV12
b689b7f38cd0 drm/i915/skl+: rename skl_wm_values struct to skl_ddb_values
---- Possible new issues:

Test kms_cursor_legacy:
        Subgroup flip-vs-cursor-atomic-transitions-varying-size:
                pass       -> FAIL       (shard-hsw)
Test kms_plane_scaling:
        Subgroup pipe-a-scaler-with-pixel-format:
                pass       -> FAIL       (shard-apl)
        Subgroup pipe-a-scaler-with-rotation:
                pass       -> FAIL       (shard-apl)
        Subgroup pipe-b-scaler-with-pixel-format:
                pass       -> FAIL       (shard-apl)
        Subgroup pipe-b-scaler-with-rotation:
                pass       -> FAIL       (shard-apl)

---- Known issues:

Test kms_flip:
        Subgroup flip-vs-wf_vblank-interruptible:
                fail       -> PASS       (shard-hsw) fdo#100368
Test kms_setmode:
        Subgroup basic:
                pass       -> FAIL       (shard-apl) fdo#99912
Test kms_sysfs_edid_timing:
                pass       -> WARN       (shard-apl) fdo#100047

fdo#100368 https://bugs.freedesktop.org/show_bug.cgi?id=100368
fdo#99912 https://bugs.freedesktop.org/show_bug.cgi?id=99912
fdo#100047 https://bugs.freedesktop.org/show_bug.cgi?id=100047

shard-apl        total:3478 pass:1810 dwarn:1   dfail:0   fail:11  skip:1655 time:13126s
shard-hsw        total:3478 pass:1767 dwarn:1   dfail:0   fail:2   skip:1707 time:11903s
shard-snb        total:3478 pass:1357 dwarn:1   dfail:0   fail:3   skip:2117 time:7274s
Blacklisted hosts:
shard-kbl        total:3478 pass:1935 dwarn:1   dfail:1   fail:13  skip:1528 time:9960s

Patches download mbox

Tests

Series 38919v17 Add NV12 support
https://patchwork.freedesktop.org/api/1.0/series/38919/revisions/17/mbox/

---- Known issues:

Test gem_exec_suspend:
        Subgroup basic-s3:
                incomplete -> PASS       (fi-skl-6260u) fdo#104108
Test gem_mmap_gtt:
        Subgroup basic-small-bo-tiledx:
                fail       -> PASS       (fi-gdg-551) fdo#102575
Test kms_pipe_crc_basic:
        Subgroup hang-read-crc-pipe-b:
                incomplete -> PASS       (fi-cnl-y3) fdo#103191
Test prime_vgem:
        Subgroup basic-fence-flip:
                pass       -> FAIL       (fi-ilk-650) fdo#104008

fdo#104108 https://bugs.freedesktop.org/show_bug.cgi?id=104108
fdo#102575 https://bugs.freedesktop.org/show_bug.cgi?id=102575
fdo#103191 https://bugs.freedesktop.org/show_bug.cgi?id=103191
fdo#104008 https://bugs.freedesktop.org/show_bug.cgi?id=104008

fi-bdw-5557u     total:285  pass:264  dwarn:0   dfail:0   fail:0   skip:21  time:432s
fi-bdw-gvtdvm    total:285  pass:261  dwarn:0   dfail:0   fail:0   skip:24  time:444s
fi-blb-e6850     total:285  pass:220  dwarn:1   dfail:0   fail:0   skip:64  time:382s
fi-bsw-n3050     total:285  pass:239  dwarn:0   dfail:0   fail:0   skip:46  time:542s
fi-bwr-2160      total:285  pass:180  dwarn:0   dfail:0   fail:0   skip:105 time:300s
fi-bxt-dsi       total:285  pass:255  dwarn:0   dfail:0   fail:0   skip:30  time:517s
fi-bxt-j4205     total:285  pass:256  dwarn:0   dfail:0   fail:0   skip:29  time:512s
fi-byt-j1900     total:285  pass:250  dwarn:0   dfail:0   fail:0   skip:35  time:528s
fi-byt-n2820     total:285  pass:246  dwarn:0   dfail:0   fail:0   skip:39  time:515s
fi-cfl-8700k     total:285  pass:257  dwarn:0   dfail:0   fail:0   skip:28  time:412s
fi-cfl-s3        total:285  pass:259  dwarn:0   dfail:0   fail:0   skip:26  time:568s
fi-cfl-u         total:285  pass:259  dwarn:0   dfail:0   fail:0   skip:26  time:514s
fi-cnl-y3        total:285  pass:258  dwarn:1   dfail:0   fail:0   skip:26  time:587s
fi-elk-e7500     total:285  pass:225  dwarn:1   dfail:0   fail:0   skip:59  time:431s
fi-gdg-551       total:285  pass:177  dwarn:0   dfail:0   fail:0   skip:108 time:322s
fi-glk-1         total:285  pass:257  dwarn:0   dfail:0   fail:0   skip:28  time:540s
fi-hsw-4770      total:285  pass:258  dwarn:0   dfail:0   fail:0   skip:27  time:418s
fi-ilk-650       total:285  pass:224  dwarn:0   dfail:0   fail:1   skip:60  time:425s
fi-ivb-3520m     total:285  pass:256  dwarn:0   dfail:0   fail:0   skip:29  time:474s
fi-ivb-3770      total:285  pass:252  dwarn:0   dfail:0   fail:0   skip:33  time:430s
fi-kbl-7500u     total:285  pass:260  dwarn:1   dfail:0   fail:0   skip:24  time:476s
fi-kbl-7567u     total:285  pass:265  dwarn:0   dfail:0   fail:0   skip:20  time:469s
fi-kbl-r         total:285  pass:258  dwarn:0   dfail:0   fail:0   skip:27  time:516s
fi-pnv-d510      total:285  pass:219  dwarn:1   dfail:0   fail:0   skip:65  time:661s
fi-skl-6260u     total:285  pass:265  dwarn:0   dfail:0   fail:0   skip:20  time:449s
fi-skl-6600u     total:285  pass:258  dwarn:0   dfail:0   fail:0   skip:27  time:534s
fi-skl-6700k2    total:285  pass:261  dwarn:0   dfail:0   fail:0   skip:24  time:498s
fi-skl-6770hq    total:285  pass:265  dwarn:0   dfail:0   fail:0   skip:20  time:513s
fi-skl-guc       total:285  pass:257  dwarn:0   dfail:0   fail:0   skip:28  time:429s
fi-skl-gvtdvm    total:285  pass:262  dwarn:0   dfail:0   fail:0   skip:23  time:450s
fi-snb-2520m     total:285  pass:245  dwarn:0   dfail:0   fail:0   skip:40  time:565s
fi-snb-2600      total:285  pass:245  dwarn:0   dfail:0   fail:0   skip:40  time:413s
Blacklisted hosts:
fi-cnl-psr       total:285  pass:256  dwarn:3   dfail:0   fail:0   skip:26  time:539s
fi-glk-j4005     total:285  pass:255  dwarn:1   dfail:0   fail:0   skip:29  time:487s

4fedafb2f0f2c3b67f03fe879e10d0d2f3f29776 drm-tip: 2018y-03m-27d-17h-36m-53s UTC integration manifest
b837cd921207 drm/i915: Do not truncate fb sizes for NV12
ae55f02d56de drm/i915: Add checks to primary plane
576af83db001 drm/i915: Display WA 827
5c7525647d7f drm/i915: Enable YUV to RGB for Gen10 in Plane Ctrl Reg
40083a4e08e7 drm/i915: Add NV12 support to intel_framebuffer_init
14e0f959b7c2 drm/i915: Add NV12 as supported format for sprite plane
b4dd2988c3e9 drm/i915: Add NV12 as supported format for primary plane
f03a715c8b68 drm/i915: Upscale scaler max scale for NV12
5c3a0692a859 drm/i915: Update format_is_yuv() to include NV12
22178a2458d0 drm/i915: Set scaler mode for NV12
7665a1f924f3 drm/i915/skl: split skl_compute_ddb function
7cc68bfb3ec7 drm/i915/skl+: nv12 workaround disable WM level 1-7
babd3d720f19 drm/i915/skl+: make sure higher latency level has higher wm value
d30d0bc02c2b drm/i915/skl+: pass skl_wm_level struct to wm compute func
9f32a2a394e3 drm/i915/skl+: NV12 related changes for WM
4d11f01090d7 drm/i915/skl+: support verification of DDB HW state for NV12
85909f950176 drm/i915/skl+: add NV12 in skl_format_to_fourcc
a9f4575effa8 drm/i915/skl+: refactor WM calculation for NV12
87daad1a3285 drm/i915/skl+: rename skl_wm_values struct to skl_ddb_values
---- Possible new issues:

Test kms_plane_scaling:
        Subgroup pipe-a-scaler-with-rotation:
                pass       -> DMESG-WARN (shard-apl)
        Subgroup pipe-b-scaler-with-rotation:
                pass       -> DMESG-WARN (shard-apl)

---- Known issues:

Test drv_selftest:
        Subgroup live_gtt:
                pass       -> INCOMPLETE (shard-apl) fdo#103927
Test kms_flip:
        Subgroup 2x-flip-vs-absolute-wf_vblank:
                fail       -> PASS       (shard-hsw) fdo#100368 +2
        Subgroup 2x-flip-vs-expired-vblank-interruptible:
                pass       -> FAIL       (shard-hsw) fdo#102887 +1
        Subgroup flip-vs-panning-vs-hang:
                dmesg-warn -> PASS       (shard-snb) fdo#103821
Test kms_frontbuffer_tracking:
        Subgroup fbc-1p-offscren-pri-shrfb-draw-mmap-gtt:
                pass       -> FAIL       (shard-apl) fdo#103167 +1
        Subgroup fbc-1p-offscren-pri-shrfb-draw-render:
                pass       -> FAIL       (shard-apl) fdo#105685
Test kms_setmode:
        Subgroup basic:
                pass       -> FAIL       (shard-hsw) fdo#99912

fdo#103927 https://bugs.freedesktop.org/show_bug.cgi?id=103927
fdo#100368 https://bugs.freedesktop.org/show_bug.cgi?id=100368
fdo#102887 https://bugs.freedesktop.org/show_bug.cgi?id=102887
fdo#103821 https://bugs.freedesktop.org/show_bug.cgi?id=103821
fdo#103167 https://bugs.freedesktop.org/show_bug.cgi?id=103167
fdo#105685 https://bugs.freedesktop.org/show_bug.cgi?id=105685
fdo#99912 https://bugs.freedesktop.org/show_bug.cgi?id=99912

shard-apl        total:3473 pass:1803 dwarn:3   dfail:0   fail:10  skip:1655 time:12425s
shard-hsw        total:3495 pass:1782 dwarn:1   dfail:0   fail:2   skip:1709 time:11652s
shard-snb        total:3495 pass:1374 dwarn:1   dfail:0   fail:3   skip:2117 time:7017s
Blacklisted hosts:
shard-kbl        total:3495 pass:1947 dwarn:7   dfail:1   fail:12  skip:1528 time:9700s
SERIES REVISION LOOKS STRANGE. Please double-check patch list and the ordering before proceeding.

Patches download mbox

Tests

CHK     include/config/kernel.release
  CHK     include/generated/uapi/linux/version.h
  CHK     include/generated/utsrelease.h
  CHK     include/generated/bounds.h
  CHK     include/generated/timeconst.h
  CHK     include/generated/asm-offsets.h
  CALL    scripts/checksyscalls.sh
  DESCEND  objtool
  CHK     scripts/mod/devicetable-offsets.h
  CHK     include/generated/compile.h
  CHK     kernel/config_data.h
  CC [M]  drivers/gpu/drm/i915/intel_sprite.o
In file included from drivers/gpu/drm/i915/intel_drv.h:33:0,
                 from drivers/gpu/drm/i915/intel_sprite.c:39:
drivers/gpu/drm/i915/intel_sprite.c: In function ‘skl_update_plane’:
drivers/gpu/drm/i915/intel_sprite.c:305:38: error: suggest parentheses around arithmetic in operand of ‘|’ [-Werror=parentheses]
          (crtc_w + 1) << 16 | crtc_h + 1);
                               ~~~~~~~^~~
drivers/gpu/drm/i915/i915_drv.h:3626:76: note: in definition of macro ‘I915_WRITE_FW’
 #define I915_WRITE_FW(reg__, val__) __raw_i915_write32(dev_priv, (reg__), (val__))
                                                                            ^~~~~
cc1: all warnings being treated as errors
scripts/Makefile.build:324: recipe for target 'drivers/gpu/drm/i915/intel_sprite.o' failed
make[4]: *** [drivers/gpu/drm/i915/intel_sprite.o] Error 1
scripts/Makefile.build:583: recipe for target 'drivers/gpu/drm/i915' failed
make[3]: *** [drivers/gpu/drm/i915] Error 2
scripts/Makefile.build:583: recipe for target 'drivers/gpu/drm' failed
make[2]: *** [drivers/gpu/drm] Error 2
scripts/Makefile.build:583: recipe for target 'drivers/gpu' failed
make[1]: *** [drivers/gpu] Error 2
Makefile:1060: recipe for target 'drivers' failed
make: *** [drivers] Error 2
SERIES REVISION LOOKS STRANGE. Please double-check patch list and the ordering before proceeding.

Patches download mbox

Tests

Series 38919v19 Add NV12 support
https://patchwork.freedesktop.org/api/1.0/series/38919/revisions/19/mbox/

fi-bdw-5557u     total:285  pass:264  dwarn:0   dfail:0   fail:0   skip:21  time:435s
fi-bdw-gvtdvm    total:285  pass:261  dwarn:0   dfail:0   fail:0   skip:24  time:442s
fi-blb-e6850     total:285  pass:220  dwarn:1   dfail:0   fail:0   skip:64  time:385s
fi-bsw-n3050     total:285  pass:239  dwarn:0   dfail:0   fail:0   skip:46  time:542s
fi-bwr-2160      total:285  pass:180  dwarn:0   dfail:0   fail:0   skip:105 time:299s
fi-bxt-dsi       total:285  pass:255  dwarn:0   dfail:0   fail:0   skip:30  time:515s
fi-bxt-j4205     total:285  pass:256  dwarn:0   dfail:0   fail:0   skip:29  time:510s
fi-byt-j1900     total:285  pass:250  dwarn:0   dfail:0   fail:0   skip:35  time:522s
fi-byt-n2820     total:285  pass:246  dwarn:0   dfail:0   fail:0   skip:39  time:512s
fi-cfl-8700k     total:285  pass:257  dwarn:0   dfail:0   fail:0   skip:28  time:413s
fi-cfl-s3        total:285  pass:259  dwarn:0   dfail:0   fail:0   skip:26  time:569s
fi-cfl-u         total:285  pass:259  dwarn:0   dfail:0   fail:0   skip:26  time:515s
fi-cnl-y3        total:285  pass:259  dwarn:0   dfail:0   fail:0   skip:26  time:582s
fi-elk-e7500     total:285  pass:225  dwarn:1   dfail:0   fail:0   skip:59  time:428s
fi-gdg-551       total:285  pass:177  dwarn:0   dfail:0   fail:0   skip:108 time:325s
fi-glk-1         total:285  pass:257  dwarn:0   dfail:0   fail:0   skip:28  time:537s
fi-hsw-4770      total:285  pass:258  dwarn:0   dfail:0   fail:0   skip:27  time:403s
fi-ilk-650       total:285  pass:225  dwarn:0   dfail:0   fail:0   skip:60  time:421s
fi-ivb-3520m     total:285  pass:256  dwarn:0   dfail:0   fail:0   skip:29  time:470s
fi-ivb-3770      total:285  pass:252  dwarn:0   dfail:0   fail:0   skip:33  time:441s
fi-kbl-7500u     total:285  pass:260  dwarn:1   dfail:0   fail:0   skip:24  time:477s
fi-kbl-7567u     total:285  pass:265  dwarn:0   dfail:0   fail:0   skip:20  time:471s
fi-kbl-r         total:285  pass:258  dwarn:0   dfail:0   fail:0   skip:27  time:520s
fi-pnv-d510      total:285  pass:219  dwarn:1   dfail:0   fail:0   skip:65  time:674s
fi-skl-6260u     total:285  pass:265  dwarn:0   dfail:0   fail:0   skip:20  time:444s
fi-skl-6600u     total:285  pass:258  dwarn:0   dfail:0   fail:0   skip:27  time:536s
fi-skl-6700k2    total:285  pass:261  dwarn:0   dfail:0   fail:0   skip:24  time:504s
fi-skl-6770hq    total:285  pass:265  dwarn:0   dfail:0   fail:0   skip:20  time:500s
fi-skl-guc       total:285  pass:257  dwarn:0   dfail:0   fail:0   skip:28  time:431s
fi-skl-gvtdvm    total:285  pass:262  dwarn:0   dfail:0   fail:0   skip:23  time:444s
fi-snb-2520m     total:285  pass:245  dwarn:0   dfail:0   fail:0   skip:40  time:578s
Blacklisted hosts:
fi-cnl-psr       total:285  pass:256  dwarn:3   dfail:0   fail:0   skip:26  time:532s
fi-glk-j4005     total:285  pass:256  dwarn:0   dfail:0   fail:0   skip:29  time:486s

23c67dc0cf31917b696b87dac997aca76c0d248d drm-tip: 2018y-03m-28d-06h-36m-40s UTC integration manifest
75b73daf33ae drm/i915: Do not truncate fb sizes for NV12
7ce47530e6bf drm/i915: Add checks to primary plane
cf7264d519b8 drm/i915: Display WA 827
f5cc13f16126 drm/i915: Enable YUV to RGB for Gen10 in Plane Ctrl Reg
6c46fcb49eac drm/i915: Add NV12 support to intel_framebuffer_init
8e706b351c01 drm/i915: Add NV12 as supported format for sprite plane
a8e7fc59a59f drm/i915: Add NV12 as supported format for primary plane
c4844131228b drm/i915: Upscale scaler max scale for NV12
19711d1eff3f drm/i915: Update format_is_yuv() to include NV12
29a94a20eeba drm/i915: Set scaler mode for NV12
f4c090e26678 drm/i915/skl: split skl_compute_ddb function
a533ae5da4e2 drm/i915/skl+: nv12 workaround disable WM level 1-7
ae9ba1c4ed10 drm/i915/skl+: make sure higher latency level has higher wm value
9778e79fd42c drm/i915/skl+: pass skl_wm_level struct to wm compute func
0b54f6249fa5 drm/i915/skl+: NV12 related changes for WM
085b43c0403a drm/i915/skl+: support verification of DDB HW state for NV12
3686a81f870f drm/i915/skl+: add NV12 in skl_format_to_fourcc
6119fbb217f1 drm/i915/skl+: refactor WM calculation for NV12
622936350f3c drm/i915/skl+: rename skl_wm_values struct to skl_ddb_values
---- Possible new issues:

Test kms_flip:
        Subgroup wf_vblank-ts-check:
                pass       -> FAIL       (shard-hsw)
Test kms_vblank:
        Subgroup pipe-c-wait-busy-hang:
                pass       -> DMESG-WARN (shard-hsw)

---- Known issues:

Test kms_flip:
        Subgroup 2x-plain-flip-ts-check-interruptible:
                fail       -> PASS       (shard-hsw) fdo#100368 +1
Test kms_frontbuffer_tracking:
        Subgroup fbc-rgb565-draw-blt:
                pass       -> FAIL       (shard-apl) fdo#103167
Test kms_setmode:
        Subgroup basic:
                pass       -> FAIL       (shard-hsw) fdo#99912

fdo#100368 https://bugs.freedesktop.org/show_bug.cgi?id=100368
fdo#103167 https://bugs.freedesktop.org/show_bug.cgi?id=103167
fdo#99912 https://bugs.freedesktop.org/show_bug.cgi?id=99912

shard-apl        total:3495 pass:1830 dwarn:1   dfail:0   fail:8   skip:1655 time:12979s
shard-hsw        total:3495 pass:1781 dwarn:2   dfail:0   fail:2   skip:1709 time:11649s
shard-snb        total:3495 pass:1373 dwarn:1   dfail:0   fail:4   skip:2117 time:7001s
Blacklisted hosts:
shard-kbl        total:3361 pass:1860 dwarn:22  dfail:0   fail:9   skip:1468 time:9289s

Patches download mbox

Tests

Series 38919v20 Add NV12 support
https://patchwork.freedesktop.org/api/1.0/series/38919/revisions/20/mbox/

---- Known issues:

Test kms_flip:
        Subgroup basic-flip-vs-wf_vblank:
                fail       -> PASS       (fi-cfl-s3) fdo#100368
Test kms_pipe_crc_basic:
        Subgroup nonblocking-crc-pipe-a-frame-sequence:
                fail       -> PASS       (fi-cfl-s3) fdo#103481 +1
        Subgroup suspend-read-crc-pipe-b:
                pass       -> INCOMPLETE (fi-snb-2520m) fdo#103713
Test prime_vgem:
        Subgroup basic-fence-flip:
                pass       -> FAIL       (fi-ilk-650) fdo#104008

fdo#100368 https://bugs.freedesktop.org/show_bug.cgi?id=100368
fdo#103481 https://bugs.freedesktop.org/show_bug.cgi?id=103481
fdo#103713 https://bugs.freedesktop.org/show_bug.cgi?id=103713
fdo#104008 https://bugs.freedesktop.org/show_bug.cgi?id=104008

fi-bdw-5557u     total:285  pass:264  dwarn:0   dfail:0   fail:0   skip:21  time:431s
fi-blb-e6850     total:285  pass:220  dwarn:1   dfail:0   fail:0   skip:64  time:379s
fi-bsw-n3050     total:285  pass:239  dwarn:0   dfail:0   fail:0   skip:46  time:536s
fi-bwr-2160      total:285  pass:180  dwarn:0   dfail:0   fail:0   skip:105 time:295s
fi-bxt-dsi       total:285  pass:255  dwarn:0   dfail:0   fail:0   skip:30  time:511s
fi-bxt-j4205     total:285  pass:256  dwarn:0   dfail:0   fail:0   skip:29  time:512s
fi-byt-j1900     total:285  pass:250  dwarn:0   dfail:0   fail:0   skip:35  time:521s
fi-byt-n2820     total:285  pass:246  dwarn:0   dfail:0   fail:0   skip:39  time:507s
fi-cfl-8700k     total:285  pass:257  dwarn:0   dfail:0   fail:0   skip:28  time:409s
fi-cfl-s3        total:285  pass:259  dwarn:0   dfail:0   fail:0   skip:26  time:559s
fi-cfl-u         total:285  pass:259  dwarn:0   dfail:0   fail:0   skip:26  time:515s
fi-cnl-y3        total:285  pass:259  dwarn:0   dfail:0   fail:0   skip:26  time:583s
fi-elk-e7500     total:285  pass:225  dwarn:1   dfail:0   fail:0   skip:59  time:423s
fi-gdg-551       total:285  pass:176  dwarn:0   dfail:0   fail:1   skip:108 time:319s
fi-glk-1         total:285  pass:257  dwarn:0   dfail:0   fail:0   skip:28  time:537s
fi-hsw-4770      total:285  pass:258  dwarn:0   dfail:0   fail:0   skip:27  time:403s
fi-ilk-650       total:285  pass:224  dwarn:0   dfail:0   fail:1   skip:60  time:418s
fi-ivb-3520m     total:285  pass:256  dwarn:0   dfail:0   fail:0   skip:29  time:462s
fi-ivb-3770      total:285  pass:252  dwarn:0   dfail:0   fail:0   skip:33  time:430s
fi-kbl-7500u     total:285  pass:260  dwarn:1   dfail:0   fail:0   skip:24  time:473s
fi-kbl-7567u     total:285  pass:265  dwarn:0   dfail:0   fail:0   skip:20  time:464s
fi-kbl-r         total:285  pass:258  dwarn:0   dfail:0   fail:0   skip:27  time:514s
fi-pnv-d510      total:285  pass:219  dwarn:1   dfail:0   fail:0   skip:65  time:663s
fi-skl-6260u     total:285  pass:265  dwarn:0   dfail:0   fail:0   skip:20  time:440s
fi-skl-6600u     total:285  pass:258  dwarn:0   dfail:0   fail:0   skip:27  time:538s
fi-skl-6700k2    total:285  pass:261  dwarn:0   dfail:0   fail:0   skip:24  time:504s
fi-skl-6770hq    total:285  pass:265  dwarn:0   dfail:0   fail:0   skip:20  time:502s
fi-skl-guc       total:285  pass:257  dwarn:0   dfail:0   fail:0   skip:28  time:431s
fi-skl-gvtdvm    total:285  pass:262  dwarn:0   dfail:0   fail:0   skip:23  time:446s
fi-snb-2520m     total:242  pass:208  dwarn:0   dfail:0   fail:0   skip:33 
fi-snb-2600      total:285  pass:245  dwarn:0   dfail:0   fail:0   skip:40  time:401s
Blacklisted hosts:
fi-cnl-psr       total:285  pass:256  dwarn:3   dfail:0   fail:0   skip:26  time:524s
fi-glk-j4005     total:285  pass:256  dwarn:0   dfail:0   fail:0   skip:29  time:485s

4668e88d66074a81aae645e0db0391e7ea9afe8a drm-tip: 2018y-03m-28d-20h-45m-29s UTC integration manifest
529724a4efe4 drm/i915: Keep plane size mult of 4 for NV12
fe954a7df265 drm/i915: Display WA 827
cc8e8fefdea9 drm/i915: Enable YUV to RGB for Gen10 in Plane Ctrl Reg
b4b677651899 drm/i915: Add NV12 support to intel_framebuffer_init
dfbbe57eda6e drm/i915: Add NV12 as supported format for sprite plane
c052c1d77e4f drm/i915: Add NV12 as supported format for primary plane
688ab3df826f drm/i915: Upscale scaler max scale for NV12
7f3af305e938 drm/i915: Update format_is_yuv() to include NV12
b2a5792f1bfd drm/i915: Set scaler mode for NV12
86ad1b4ffe3b drm/i915/skl: split skl_compute_ddb function
cad01ba1fdd8 drm/i915/skl+: nv12 workaround disable WM level 1-7
bf27373d44a7 drm/i915/skl+: make sure higher latency level has higher wm value
efeb594844a8 drm/i915/skl+: pass skl_wm_level struct to wm compute func
cb8d6c954708 drm/i915/skl+: NV12 related changes for WM
f222ced85341 drm/i915/skl+: support verification of DDB HW state for NV12
1034364376b6 drm/i915/skl+: add NV12 in skl_format_to_fourcc
2e19b1bc5c8a drm/i915/skl+: refactor WM calculation for NV12
55a16cfa7342 drm/i915/skl+: rename skl_wm_values struct to skl_ddb_values
---- Possible new issues:

Test kms_busy:
        Subgroup extended-modeset-hang-oldfb-with-reset-render-b:
                pass       -> FAIL       (shard-snb)
Test kms_flip_tiling:
        Subgroup flip-to-x-tiled:
                pass       -> FAIL       (shard-snb)
Test kms_frontbuffer_tracking:
        Subgroup fbc-1p-offscren-pri-indfb-draw-blt:
                pass       -> FAIL       (shard-apl)
        Subgroup fbc-2p-scndscrn-cur-indfb-draw-pwrite:
                skip       -> FAIL       (shard-snb)
        Subgroup fbcpsr-2p-primscrn-pri-indfb-draw-mmap-gtt:
                skip       -> FAIL       (shard-snb)
        Subgroup fbcpsr-shrfb-scaledprimary:
                skip       -> FAIL       (shard-snb)
        Subgroup psr-1p-primscrn-cur-indfb-draw-pwrite:
                skip       -> FAIL       (shard-snb)
        Subgroup psr-2p-scndscrn-pri-indfb-draw-pwrite:
                skip       -> FAIL       (shard-snb)
Test kms_mmap_write_crc:
                pass       -> FAIL       (shard-snb)
Test kms_plane:
        Subgroup pixel-format-pipe-a-planes:
                pass       -> DMESG-WARN (shard-apl)
        Subgroup pixel-format-pipe-b-planes:
                pass       -> DMESG-WARN (shard-apl)
Test kms_plane_scaling:
        Subgroup pipe-a-scaler-with-clipping-clamping:
                pass       -> DMESG-WARN (shard-apl)
        Subgroup pipe-a-scaler-with-pixel-format:
                pass       -> DMESG-WARN (shard-apl)
        Subgroup pipe-a-scaler-with-rotation:
                pass       -> DMESG-WARN (shard-apl)
        Subgroup pipe-b-scaler-with-clipping-clamping:
                pass       -> DMESG-WARN (shard-apl)
        Subgroup pipe-b-scaler-with-pixel-format:
                pass       -> DMESG-WARN (shard-apl)
        Subgroup pipe-b-scaler-with-rotation:
                pass       -> DMESG-WARN (shard-apl)
Test kms_vblank:
        Subgroup pipe-a-wait-idle-hang:
                pass       -> FAIL       (shard-snb)
        Subgroup pipe-b-accuracy-idle:
                pass       -> FAIL       (shard-snb)

---- Known issues:

Test kms_chv_cursor_fail:
        Subgroup pipe-c-128x128-right-edge:
                pass       -> FAIL       (shard-apl) fdo#104671
Test kms_cursor_crc:
        Subgroup cursor-64x64-suspend:
                incomplete -> PASS       (shard-hsw) fdo#103540
Test kms_flip:
        Subgroup 2x-flip-vs-expired-vblank:
                fail       -> PASS       (shard-hsw) fdo#102887
        Subgroup dpms-vs-vblank-race:
                fail       -> PASS       (shard-hsw) fdo#103060
        Subgroup plain-flip-ts-check:
                fail       -> PASS       (shard-hsw) fdo#100368
Test kms_frontbuffer_tracking:
        Subgroup fbc-2p-primscrn-pri-shrfb-draw-mmap-wc:
                skip       -> FAIL       (shard-snb) fdo#103167
Test kms_rotation_crc:
        Subgroup sprite-rotation-180:
                pass       -> FAIL       (shard-snb) fdo#103925

fdo#104671 https://bugs.freedesktop.org/show_bug.cgi?id=104671
fdo#103540 https://bugs.freedesktop.org/show_bug.cgi?id=103540
fdo#102887 https://bugs.freedesktop.org/show_bug.cgi?id=102887
fdo#103060 https://bugs.freedesktop.org/show_bug.cgi?id=103060
fdo#100368 https://bugs.freedesktop.org/show_bug.cgi?id=100368
fdo#103167 https://bugs.freedesktop.org/show_bug.cgi?id=103167
fdo#103925 https://bugs.freedesktop.org/show_bug.cgi?id=103925

shard-apl        total:3495 pass:1821 dwarn:9   dfail:0   fail:9   skip:1655 time:12878s
shard-hsw        total:3495 pass:1782 dwarn:1   dfail:0   fail:2   skip:1709 time:11494s
shard-snb        total:3495 pass:1369 dwarn:1   dfail:0   fail:19  skip:2106 time:6859s
Blacklisted hosts:
shard-kbl        total:3410 pass:1899 dwarn:7   dfail:0   fail:10  skip:1492 time:8576s
SERIES REVISION LOOKS STRANGE. Please double-check patch list and the ordering before proceeding.

Patches download mbox

Tests

Series 38919v21 Add NV12 support
https://patchwork.freedesktop.org/api/1.0/series/38919/revisions/21/mbox/

---- Known issues:

Test kms_pipe_crc_basic:
        Subgroup suspend-read-crc-pipe-c:
                pass       -> INCOMPLETE (fi-bxt-dsi) fdo#103927

fdo#103927 https://bugs.freedesktop.org/show_bug.cgi?id=103927

fi-bdw-5557u     total:285  pass:264  dwarn:0   dfail:0   fail:0   skip:21  time:431s
fi-bdw-gvtdvm    total:285  pass:261  dwarn:0   dfail:0   fail:0   skip:24  time:444s
fi-blb-e6850     total:285  pass:220  dwarn:1   dfail:0   fail:0   skip:64  time:387s
fi-bsw-n3050     total:285  pass:239  dwarn:0   dfail:0   fail:0   skip:46  time:542s
fi-bwr-2160      total:285  pass:180  dwarn:0   dfail:0   fail:0   skip:105 time:294s
fi-bxt-dsi       total:243  pass:216  dwarn:0   dfail:0   fail:0   skip:26 
fi-bxt-j4205     total:285  pass:256  dwarn:0   dfail:0   fail:0   skip:29  time:510s
fi-byt-j1900     total:285  pass:250  dwarn:0   dfail:0   fail:0   skip:35  time:517s
fi-byt-n2820     total:285  pass:246  dwarn:0   dfail:0   fail:0   skip:39  time:509s
fi-cfl-8700k     total:285  pass:257  dwarn:0   dfail:0   fail:0   skip:28  time:411s
fi-cfl-s3        total:285  pass:259  dwarn:0   dfail:0   fail:0   skip:26  time:562s
fi-cfl-u         total:285  pass:259  dwarn:0   dfail:0   fail:0   skip:26  time:509s
fi-cnl-y3        total:285  pass:259  dwarn:0   dfail:0   fail:0   skip:26  time:587s
fi-elk-e7500     total:285  pass:225  dwarn:1   dfail:0   fail:0   skip:59  time:423s
fi-gdg-551       total:285  pass:176  dwarn:0   dfail:0   fail:1   skip:108 time:320s
fi-glk-1         total:285  pass:257  dwarn:0   dfail:0   fail:0   skip:28  time:540s
fi-hsw-4770      total:285  pass:258  dwarn:0   dfail:0   fail:0   skip:27  time:403s
fi-ilk-650       total:285  pass:225  dwarn:0   dfail:0   fail:0   skip:60  time:420s
fi-ivb-3520m     total:285  pass:256  dwarn:0   dfail:0   fail:0   skip:29  time:470s
fi-ivb-3770      total:285  pass:252  dwarn:0   dfail:0   fail:0   skip:33  time:431s
fi-kbl-7500u     total:285  pass:260  dwarn:1   dfail:0   fail:0   skip:24  time:470s
fi-kbl-7567u     total:285  pass:265  dwarn:0   dfail:0   fail:0   skip:20  time:463s
fi-kbl-r         total:285  pass:258  dwarn:0   dfail:0   fail:0   skip:27  time:517s
fi-pnv-d510      total:285  pass:219  dwarn:1   dfail:0   fail:0   skip:65  time:659s
fi-skl-6260u     total:285  pass:265  dwarn:0   dfail:0   fail:0   skip:20  time:442s
fi-skl-6600u     total:285  pass:258  dwarn:0   dfail:0   fail:0   skip:27  time:533s
fi-skl-6700k2    total:285  pass:261  dwarn:0   dfail:0   fail:0   skip:24  time:508s
fi-skl-6770hq    total:285  pass:265  dwarn:0   dfail:0   fail:0   skip:20  time:510s
fi-skl-guc       total:285  pass:257  dwarn:0   dfail:0   fail:0   skip:28  time:429s
fi-skl-gvtdvm    total:285  pass:262  dwarn:0   dfail:0   fail:0   skip:23  time:443s
fi-snb-2520m     total:285  pass:245  dwarn:0   dfail:0   fail:0   skip:40  time:561s
fi-snb-2600      total:285  pass:245  dwarn:0   dfail:0   fail:0   skip:40  time:402s
Blacklisted hosts:
fi-cnl-psr       total:285  pass:256  dwarn:3   dfail:0   fail:0   skip:26  time:520s
fi-glk-j4005     total:285  pass:256  dwarn:0   dfail:0   fail:0   skip:29  time:485s

c46052cde6a50c5459e00791ffc4d5aa1ec58a9e drm-tip: 2018y-03m-30d-18h-56m-26s UTC integration manifest
4466220de365 drm/i915: Set src size restrictions for NV12
dc25b25f4f7e drm/i915: Display WA 827
e911180fb4bd drm/i915: Enable YUV to RGB for Gen10 in Plane Ctrl Reg
0d26baeca811 drm/i915: Add NV12 support to intel_framebuffer_init
e98bd9bb7e49 drm/i915: Add NV12 as supported format for sprite plane
bd46c139dfc3 drm/i915: Add NV12 as supported format for primary plane
dc18c3ad0ac3 drm/i915: Upscale scaler max scale for NV12
a492a567f80f drm/i915: Update format_is_yuv() to include NV12
010e5daee6d7 drm/i915: Set scaler mode for NV12
a8f9d52ea2a4 drm/i915/skl: split skl_compute_ddb function
ccbcce1ffd4c drm/i915/skl+: nv12 workaround disable WM level 1-7
afd91de7d7ac drm/i915/skl+: make sure higher latency level has higher wm value
757cddb49fcc drm/i915/skl+: pass skl_wm_level struct to wm compute func
6dd8001bace4 drm/i915/skl+: NV12 related changes for WM
6be71cdaf02e drm/i915/skl+: support verification of DDB HW state for NV12
ff7582f302ae drm/i915/skl+: add NV12 in skl_format_to_fourcc
a1a9392c9f61 drm/i915/skl+: refactor WM calculation for NV12
d1db5e9f7adc drm/i915/skl+: rename skl_wm_values struct to skl_ddb_values
---- Possible new issues:

Test kms_cursor_crc:
        Subgroup cursor-64x64-suspend:
                dmesg-warn -> PASS       (shard-snb)
Test kms_plane_scaling:
        Subgroup pipe-a-scaler-with-clipping-clamping:
                pass       -> FAIL       (shard-apl)
        Subgroup pipe-a-scaler-with-pixel-format:
                pass       -> FAIL       (shard-apl)
        Subgroup pipe-a-scaler-with-rotation:
                pass       -> FAIL       (shard-apl)
        Subgroup pipe-b-scaler-with-clipping-clamping:
                pass       -> FAIL       (shard-apl)
        Subgroup pipe-b-scaler-with-pixel-format:
                pass       -> FAIL       (shard-apl)
        Subgroup pipe-b-scaler-with-rotation:
                pass       -> FAIL       (shard-apl)
Test kms_vblank:
        Subgroup pipe-b-ts-continuation-suspend:
                pass       -> INCOMPLETE (shard-hsw)

---- Known issues:

Test gem_softpin:
        Subgroup noreloc-s3:
                incomplete -> PASS       (shard-hsw) fdo#103540
Test kms_frontbuffer_tracking:
        Subgroup fbc-1p-primscrn-shrfb-msflip-blt:
                dmesg-fail -> PASS       (shard-apl) fdo#104727
Test kms_setmode:
        Subgroup basic:
                fail       -> PASS       (shard-apl) fdo#99912

fdo#103540 https://bugs.freedesktop.org/show_bug.cgi?id=103540
fdo#104727 https://bugs.freedesktop.org/show_bug.cgi?id=104727
fdo#99912 https://bugs.freedesktop.org/show_bug.cgi?id=99912

shard-apl        total:3495 pass:1826 dwarn:1   dfail:0   fail:12  skip:1655 time:12930s
shard-hsw        total:3463 pass:1765 dwarn:1   dfail:0   fail:1   skip:1694 time:11326s
shard-snb        total:3495 pass:1374 dwarn:1   dfail:0   fail:3   skip:2117 time:7045s
Blacklisted hosts:
shard-kbl        total:3495 pass:1952 dwarn:1   dfail:0   fail:14  skip:1528 time:9278s

Patches download mbox

Tests

Series 38919v22 Add NV12 support
https://patchwork.freedesktop.org/api/1.0/series/38919/revisions/22/mbox/

---- Known issues:

Test gem_mmap_gtt:
        Subgroup basic-small-bo-tiledx:
                fail       -> PASS       (fi-gdg-551) fdo#102575
Test kms_pipe_crc_basic:
        Subgroup hang-read-crc-pipe-c:
                fail       -> PASS       (fi-skl-guc) fdo#103191

fdo#102575 https://bugs.freedesktop.org/show_bug.cgi?id=102575
fdo#103191 https://bugs.freedesktop.org/show_bug.cgi?id=103191

fi-bdw-5557u     total:285  pass:264  dwarn:0   dfail:0   fail:0   skip:21  time:431s
fi-bdw-gvtdvm    total:285  pass:261  dwarn:0   dfail:0   fail:0   skip:24  time:440s
fi-blb-e6850     total:285  pass:220  dwarn:1   dfail:0   fail:0   skip:64  time:381s
fi-bsw-n3050     total:285  pass:239  dwarn:0   dfail:0   fail:0   skip:46  time:543s
fi-bwr-2160      total:285  pass:180  dwarn:0   dfail:0   fail:0   skip:105 time:296s
fi-bxt-dsi       total:285  pass:255  dwarn:0   dfail:0   fail:0   skip:30  time:520s
fi-bxt-j4205     total:285  pass:256  dwarn:0   dfail:0   fail:0   skip:29  time:513s
fi-byt-j1900     total:285  pass:250  dwarn:0   dfail:0   fail:0   skip:35  time:523s
fi-byt-n2820     total:285  pass:246  dwarn:0   dfail:0   fail:0   skip:39  time:507s
fi-cfl-8700k     total:285  pass:257  dwarn:0   dfail:0   fail:0   skip:28  time:412s
fi-cfl-s3        total:285  pass:259  dwarn:0   dfail:0   fail:0   skip:26  time:563s
fi-cfl-u         total:285  pass:259  dwarn:0   dfail:0   fail:0   skip:26  time:511s
fi-cnl-y3        total:285  pass:259  dwarn:0   dfail:0   fail:0   skip:26  time:584s
fi-elk-e7500     total:285  pass:225  dwarn:1   dfail:0   fail:0   skip:59  time:417s
fi-gdg-551       total:285  pass:177  dwarn:0   dfail:0   fail:0   skip:108 time:317s
fi-glk-1         total:285  pass:257  dwarn:0   dfail:0   fail:0   skip:28  time:545s
fi-glk-j4005     total:285  pass:256  dwarn:0   dfail:0   fail:0   skip:29  time:484s
fi-hsw-4770      total:285  pass:258  dwarn:0   dfail:0   fail:0   skip:27  time:404s
fi-ilk-650       total:285  pass:225  dwarn:0   dfail:0   fail:0   skip:60  time:420s
fi-ivb-3520m     total:285  pass:256  dwarn:0   dfail:0   fail:0   skip:29  time:467s
fi-ivb-3770      total:285  pass:252  dwarn:0   dfail:0   fail:0   skip:33  time:435s
fi-kbl-7500u     total:285  pass:260  dwarn:1   dfail:0   fail:0   skip:24  time:471s
fi-kbl-7567u     total:285  pass:265  dwarn:0   dfail:0   fail:0   skip:20  time:465s
fi-kbl-r         total:285  pass:258  dwarn:0   dfail:0   fail:0   skip:27  time:510s
fi-pnv-d510      total:285  pass:219  dwarn:1   dfail:0   fail:0   skip:65  time:664s
fi-skl-6260u     total:285  pass:265  dwarn:0   dfail:0   fail:0   skip:20  time:439s
fi-skl-6600u     total:285  pass:258  dwarn:0   dfail:0   fail:0   skip:27  time:541s
fi-skl-6700k2    total:285  pass:261  dwarn:0   dfail:0   fail:0   skip:24  time:504s
fi-skl-6770hq    total:285  pass:265  dwarn:0   dfail:0   fail:0   skip:20  time:496s
fi-skl-guc       total:285  pass:257  dwarn:0   dfail:0   fail:0   skip:28  time:428s
fi-skl-gvtdvm    total:285  pass:262  dwarn:0   dfail:0   fail:0   skip:23  time:446s
fi-snb-2520m     total:285  pass:245  dwarn:0   dfail:0   fail:0   skip:40  time:567s
fi-snb-2600      total:285  pass:245  dwarn:0   dfail:0   fail:0   skip:40  time:399s
Blacklisted hosts:
fi-cnl-psr       total:285  pass:256  dwarn:3   dfail:0   fail:0   skip:26  time:519s

1c1f24f54234a760e02c8aac04a5714ae63fa2f0 drm-tip: 2018y-04m-04d-08h-24m-53s UTC integration manifest
da8c08e0cb8e drm/i915: Set src dest size restrictions for NV12
7270cd4b87f9 drm/i915: Add NV12 support to intel_framebuffer_init
b7565f458901 drm/i915: Add NV12 as supported format for sprite plane
fa5a7d750182 drm/i915: Add NV12 as supported format for primary plane
1786e89adc42 drm/i915: Upscale scaler max scale for NV12
dfaa98af9caf drm/i915: Update format_is_yuv() to include NV12
226f68596917 drm/i915: Set scaler mode for NV12
0b1393a6466a drm/i915: Enable YUV to RGB for Gen10 in Plane Ctrl Reg
2f3af129d1a4 drm/i915: Display WA 827
fba52860ccff drm/i915/skl: split skl_compute_ddb function
2983982566be drm/i915/skl+: nv12 workaround disable WM level 1-7
ee185ebcd005 drm/i915/skl+: make sure higher latency level has higher wm value
5c110cd00291 drm/i915/skl+: pass skl_wm_level struct to wm compute func
215eea2ba2f0 drm/i915/skl+: NV12 related changes for WM
5ca0a258099f drm/i915/skl+: support verification of DDB HW state for NV12
c4f9175fa5ac drm/i915/skl+: add NV12 in skl_format_to_fourcc
d62a927075a0 drm/i915/skl+: refactor WM calculation for NV12
e11fb16cdac8 drm/i915/skl+: rename skl_wm_values struct to skl_ddb_values
---- Possible new issues:

Test kms_cursor_crc:
        Subgroup cursor-64x64-random:
                skip       -> PASS       (shard-snb)
Test kms_frontbuffer_tracking:
        Subgroup fbc-2p-scndscrn-cur-indfb-draw-mmap-gtt:
                skip       -> PASS       (shard-hsw)
        Subgroup fbc-2p-scndscrn-cur-indfb-draw-mmap-wc:
                skip       -> PASS       (shard-hsw)
        Subgroup fbc-2p-scndscrn-indfb-plflip-blt:
                skip       -> PASS       (shard-hsw)

---- Known issues:

Test kms_cursor_legacy:
        Subgroup flip-vs-cursor-varying-size:
                fail       -> PASS       (shard-hsw) fdo#102670
Test kms_flip:
        Subgroup plain-flip-fb-recreate:
                fail       -> PASS       (shard-hsw) fdo#100368
Test kms_vblank:
        Subgroup pipe-c-query-forked-busy:
                dmesg-warn -> PASS       (shard-hsw) fdo#102614

fdo#102670 https://bugs.freedesktop.org/show_bug.cgi?id=102670
fdo#100368 https://bugs.freedesktop.org/show_bug.cgi?id=100368
fdo#102614 https://bugs.freedesktop.org/show_bug.cgi?id=102614

shard-apl        total:3498 pass:1835 dwarn:1   dfail:0   fail:7   skip:1655 time:12879s
shard-hsw        total:3498 pass:1785 dwarn:1   dfail:0   fail:1   skip:1710 time:11595s
shard-snb        total:3498 pass:1377 dwarn:1   dfail:0   fail:2   skip:2118 time:7051s
Blacklisted hosts:
shard-kbl        total:3498 pass:1962 dwarn:1   dfail:0   fail:7   skip:1528 time:9310s

Patches download mbox

Tests

Series 38919v25 Add NV12 support
https://patchwork.freedesktop.org/api/1.0/series/38919/revisions/25/mbox/

---- Known issues:

Test gem_exec_suspend:
        Subgroup basic-s3:
                dmesg-warn -> PASS       (fi-glk-j4005) fdo#103359
Test kms_flip:
        Subgroup basic-flip-vs-wf_vblank:
                pass       -> FAIL       (fi-cfl-s3) fdo#100368

fdo#103359 https://bugs.freedesktop.org/show_bug.cgi?id=103359
fdo#100368 https://bugs.freedesktop.org/show_bug.cgi?id=100368

fi-bdw-5557u     total:285  pass:264  dwarn:0   dfail:0   fail:0   skip:21  time:431s
fi-bdw-gvtdvm    total:285  pass:261  dwarn:0   dfail:0   fail:0   skip:24  time:441s
fi-blb-e6850     total:285  pass:220  dwarn:1   dfail:0   fail:0   skip:64  time:380s
fi-bsw-n3050     total:285  pass:239  dwarn:0   dfail:0   fail:0   skip:46  time:538s
fi-bwr-2160      total:285  pass:180  dwarn:0   dfail:0   fail:0   skip:105 time:297s
fi-bxt-dsi       total:285  pass:255  dwarn:0   dfail:0   fail:0   skip:30  time:513s
fi-bxt-j4205     total:285  pass:256  dwarn:0   dfail:0   fail:0   skip:29  time:512s
fi-byt-j1900     total:285  pass:250  dwarn:0   dfail:0   fail:0   skip:35  time:520s
fi-byt-n2820     total:285  pass:246  dwarn:0   dfail:0   fail:0   skip:39  time:508s
fi-cfl-8700k     total:285  pass:257  dwarn:0   dfail:0   fail:0   skip:28  time:414s
fi-cfl-s3        total:285  pass:258  dwarn:0   dfail:0   fail:1   skip:26  time:558s
fi-cfl-u         total:285  pass:259  dwarn:0   dfail:0   fail:0   skip:26  time:512s
fi-elk-e7500     total:285  pass:226  dwarn:0   dfail:0   fail:0   skip:59  time:424s
fi-gdg-551       total:285  pass:176  dwarn:0   dfail:0   fail:1   skip:108 time:317s
fi-glk-1         total:285  pass:257  dwarn:0   dfail:0   fail:0   skip:28  time:543s
fi-glk-j4005     total:285  pass:256  dwarn:0   dfail:0   fail:0   skip:29  time:487s
fi-hsw-4770      total:285  pass:258  dwarn:0   dfail:0   fail:0   skip:27  time:403s
fi-ilk-650       total:285  pass:225  dwarn:0   dfail:0   fail:0   skip:60  time:421s
fi-ivb-3520m     total:285  pass:256  dwarn:0   dfail:0   fail:0   skip:29  time:470s
fi-ivb-3770      total:285  pass:252  dwarn:0   dfail:0   fail:0   skip:33  time:432s
fi-kbl-7500u     total:285  pass:260  dwarn:1   dfail:0   fail:0   skip:24  time:472s
fi-kbl-7567u     total:285  pass:265  dwarn:0   dfail:0   fail:0   skip:20  time:462s
fi-kbl-r         total:285  pass:258  dwarn:0   dfail:0   fail:0   skip:27  time:509s
fi-skl-6260u     total:285  pass:265  dwarn:0   dfail:0   fail:0   skip:20  time:442s
fi-skl-6600u     total:285  pass:258  dwarn:0   dfail:0   fail:0   skip:27  time:534s
fi-skl-6700k2    total:285  pass:261  dwarn:0   dfail:0   fail:0   skip:24  time:510s
fi-skl-6770hq    total:285  pass:265  dwarn:0   dfail:0   fail:0   skip:20  time:502s
fi-skl-guc       total:285  pass:257  dwarn:0   dfail:0   fail:0   skip:28  time:431s
fi-skl-gvtdvm    total:285  pass:262  dwarn:0   dfail:0   fail:0   skip:23  time:447s
fi-snb-2520m     total:285  pass:245  dwarn:0   dfail:0   fail:0   skip:40  time:580s
fi-snb-2600      total:285  pass:245  dwarn:0   dfail:0   fail:0   skip:40  time:399s
Blacklisted hosts:
fi-cnl-psr       total:285  pass:256  dwarn:3   dfail:0   fail:0   skip:26  time:521s

e29a10513429cca404e9847a399efbdbb4bdd4bf drm-tip: 2018y-04m-04d-20h-47m-24s UTC integration manifest
6ae8f6d43610 drm/i915: Do not do fb src adjustments for NV12
8e6666039670 drm/i915: Add NV12 support to intel_framebuffer_init
c1f97bd5fa35 drm/i915: Add NV12 as supported format for sprite plane
881a7ceb7fe1 drm/i915: Add NV12 as supported format for primary plane
b7783f2b203c drm/i915: Upscale scaler max scale for NV12
6c528ffa4868 drm/i915: Update format_is_yuv() to include NV12
0b3ba0f53e93 drm/i915: Set scaler mode for NV12
672b5c5899f7 drm/i915: Enable YUV to RGB for Gen10 in Plane Ctrl Reg
42a480ded1c9 drm/i915: Display WA 827
44288b145ca5 drm/i915/skl: split skl_compute_ddb function
6bbc93dfdf7b drm/i915/skl+: nv12 workaround disable WM level 1-7
c240142f7f63 drm/i915/skl+: make sure higher latency level has higher wm value
38d621bbd415 drm/i915/skl+: pass skl_wm_level struct to wm compute func
e96e7d7ac0e3 drm/i915/skl+: NV12 related changes for WM
9c25e3497425 drm/i915/skl+: support verification of DDB HW state for NV12
860df2bc6a11 drm/i915/skl+: add NV12 in skl_format_to_fourcc
b04b0817e4e2 drm/i915/skl+: refactor WM calculation for NV12
d4f31d9b774b drm/i915/skl+: rename skl_wm_values struct to skl_ddb_values
---- Possible new issues:

Test kms_cursor_crc:
        Subgroup cursor-128x128-suspend:
                pass       -> FAIL       (shard-apl)

---- Known issues:

Test kms_cursor_legacy:
        Subgroup 2x-long-cursor-vs-flip-legacy:
                pass       -> SKIP       (shard-hsw) fdo#105767
        Subgroup flip-vs-cursor-toggle:
                pass       -> FAIL       (shard-hsw) fdo#102670
Test kms_flip:
        Subgroup 2x-dpms-vs-vblank-race-interruptible:
                pass       -> FAIL       (shard-hsw) fdo#103060
        Subgroup 2x-flip-vs-expired-vblank-interruptible:
                fail       -> PASS       (shard-hsw) fdo#102887
        Subgroup plain-flip-fb-recreate-interruptible:
                pass       -> FAIL       (shard-hsw) fdo#100368 +4
Test kms_frontbuffer_tracking:
        Subgroup fbc-1p-offscren-pri-shrfb-draw-pwrite:
                dmesg-fail -> PASS       (shard-apl) fdo#105685
Test kms_plane_multiple:
        Subgroup atomic-pipe-a-tiling-x:
                pass       -> FAIL       (shard-snb) fdo#103166
Test kms_rotation_crc:
        Subgroup sprite-rotation-180:
                pass       -> FAIL       (shard-snb) fdo#103925

fdo#105767 https://bugs.freedesktop.org/show_bug.cgi?id=105767
fdo#102670 https://bugs.freedesktop.org/show_bug.cgi?id=102670
fdo#103060 https://bugs.freedesktop.org/show_bug.cgi?id=103060
fdo#102887 https://bugs.freedesktop.org/show_bug.cgi?id=102887
fdo#100368 https://bugs.freedesktop.org/show_bug.cgi?id=100368
fdo#105685 https://bugs.freedesktop.org/show_bug.cgi?id=105685
fdo#103166 https://bugs.freedesktop.org/show_bug.cgi?id=103166
fdo#103925 https://bugs.freedesktop.org/show_bug.cgi?id=103925

shard-apl        total:3499 pass:1834 dwarn:1   dfail:0   fail:8   skip:1655 time:12847s
shard-hsw        total:3499 pass:1779 dwarn:1   dfail:0   fail:7   skip:1711 time:11387s
shard-snb        total:3499 pass:1376 dwarn:1   dfail:0   fail:4   skip:2118 time:7038s
Blacklisted hosts:
shard-kbl        total:3429 pass:1920 dwarn:1   dfail:0   fail:5   skip:1502 time:9049s

Patches download mbox

Tests

Series 38919v26 Add NV12 support
https://patchwork.freedesktop.org/api/1.0/series/38919/revisions/26/mbox/

---- Known issues:

Test debugfs_test:
        Subgroup read_all_entries:
                pass       -> INCOMPLETE (fi-snb-2520m) fdo#103713
Test gem_mmap_gtt:
        Subgroup basic-small-bo-tiledx:
                pass       -> FAIL       (fi-gdg-551) fdo#102575
Test kms_pipe_crc_basic:
        Subgroup suspend-read-crc-pipe-a:
                dmesg-warn -> PASS       (fi-cnl-y3) fdo#104951
        Subgroup suspend-read-crc-pipe-b:
                pass       -> INCOMPLETE (fi-bdw-5557u) fdo#104944
        Subgroup suspend-read-crc-pipe-c:
                pass       -> INCOMPLETE (fi-bxt-dsi) fdo#103927
Test prime_vgem:
        Subgroup basic-fence-flip:
                fail       -> PASS       (fi-ilk-650) fdo#104008

fdo#103713 https://bugs.freedesktop.org/show_bug.cgi?id=103713
fdo#102575 https://bugs.freedesktop.org/show_bug.cgi?id=102575
fdo#104951 https://bugs.freedesktop.org/show_bug.cgi?id=104951
fdo#104944 https://bugs.freedesktop.org/show_bug.cgi?id=104944
fdo#103927 https://bugs.freedesktop.org/show_bug.cgi?id=103927
fdo#104008 https://bugs.freedesktop.org/show_bug.cgi?id=104008

fi-bdw-5557u     total:242  pass:224  dwarn:0   dfail:0   fail:0   skip:17 
fi-bdw-gvtdvm    total:285  pass:261  dwarn:0   dfail:0   fail:0   skip:24  time:443s
fi-blb-e6850     total:285  pass:220  dwarn:1   dfail:0   fail:0   skip:64  time:384s
fi-bsw-n3050     total:285  pass:239  dwarn:0   dfail:0   fail:0   skip:46  time:543s
fi-bwr-2160      total:285  pass:180  dwarn:0   dfail:0   fail:0   skip:105 time:300s
fi-bxt-dsi       total:243  pass:216  dwarn:0   dfail:0   fail:0   skip:26 
fi-bxt-j4205     total:285  pass:256  dwarn:0   dfail:0   fail:0   skip:29  time:515s
fi-byt-j1900     total:285  pass:250  dwarn:0   dfail:0   fail:0   skip:35  time:522s
fi-byt-n2820     total:285  pass:246  dwarn:0   dfail:0   fail:0   skip:39  time:513s
fi-cfl-8700k     total:285  pass:257  dwarn:0   dfail:0   fail:0   skip:28  time:410s
fi-cfl-s3        total:285  pass:259  dwarn:0   dfail:0   fail:0   skip:26  time:560s
fi-cfl-u         total:285  pass:259  dwarn:0   dfail:0   fail:0   skip:26  time:514s
fi-cnl-y3        total:285  pass:259  dwarn:0   dfail:0   fail:0   skip:26  time:584s
fi-elk-e7500     total:285  pass:226  dwarn:0   dfail:0   fail:0   skip:59  time:418s
fi-gdg-551       total:285  pass:176  dwarn:0   dfail:0   fail:1   skip:108 time:318s
fi-glk-1         total:285  pass:257  dwarn:0   dfail:0   fail:0   skip:28  time:540s
fi-glk-j4005     total:285  pass:256  dwarn:0   dfail:0   fail:0   skip:29  time:492s
fi-hsw-4770      total:285  pass:258  dwarn:0   dfail:0   fail:0   skip:27  time:405s
fi-ilk-650       total:285  pass:225  dwarn:0   dfail:0   fail:0   skip:60  time:424s
fi-ivb-3520m     total:285  pass:256  dwarn:0   dfail:0   fail:0   skip:29  time:472s
fi-ivb-3770      total:285  pass:252  dwarn:0   dfail:0   fail:0   skip:33  time:435s
fi-kbl-7500u     total:285  pass:260  dwarn:1   dfail:0   fail:0   skip:24  time:474s
fi-kbl-7567u     total:285  pass:265  dwarn:0   dfail:0   fail:0   skip:20  time:465s
fi-kbl-r         total:285  pass:258  dwarn:0   dfail:0   fail:0   skip:27  time:507s
fi-pnv-d510      total:285  pass:220  dwarn:1   dfail:0   fail:0   skip:64  time:677s
fi-skl-6260u     total:285  pass:265  dwarn:0   dfail:0   fail:0   skip:20  time:445s
fi-skl-6600u     total:285  pass:258  dwarn:0   dfail:0   fail:0   skip:27  time:535s
fi-skl-6700k2    total:285  pass:261  dwarn:0   dfail:0   fail:0   skip:24  time:509s
fi-skl-6770hq    total:285  pass:265  dwarn:0   dfail:0   fail:0   skip:20  time:504s
fi-skl-guc       total:285  pass:257  dwarn:0   dfail:0   fail:0   skip:28  time:428s
fi-skl-gvtdvm    total:285  pass:262  dwarn:0   dfail:0   fail:0   skip:23  time:446s
fi-snb-2520m     total:3    pass:2    dwarn:0   dfail:0   fail:0   skip:0  
fi-snb-2600      total:285  pass:245  dwarn:0   dfail:0   fail:0   skip:40  time:406s
Blacklisted hosts:
fi-cnl-psr       total:285  pass:256  dwarn:3   dfail:0   fail:0   skip:26  time:515s

fcaf73c13c14d6bfd64c4f37089bf5437fb32221 drm-tip: 2018y-04m-05d-15h-53m-18s UTC integration manifest
162049bd7381 drm/i915: Do not do fb src adjustments for NV12
1b9b49007418 drm/i915: Add NV12 support to intel_framebuffer_init
c430a02ceea2 drm/i915: Add NV12 as supported format for sprite plane
ccf6d27398ee drm/i915: Add NV12 as supported format for primary plane
e115acc0ec6b drm/i915: Upscale scaler max scale for NV12
d847763279e3 drm/i915: Update format_is_yuv() to include NV12
b0a1d5033d53 drm/i915: Set scaler mode for NV12
ad6e45088b6d drm/i915: Enable YUV to RGB for Gen10 in Plane Ctrl Reg
1aabdc0d5239 drm/i915: Display WA 827
ef0fd9ef56f4 drm/i915/skl: split skl_compute_ddb function
1bc47541914b drm/i915/skl+: nv12 workaround disable WM level 1-7
8cadf4b5a6c4 drm/i915/skl+: make sure higher latency level has higher wm value
4709599a18bd drm/i915/skl+: pass skl_wm_level struct to wm compute func
56624655d471 drm/i915/skl+: NV12 related changes for WM
e8e9f22ce6e3 drm/i915/skl+: support verification of DDB HW state for NV12
4ea80281da99 drm/i915/skl+: add NV12 in skl_format_to_fourcc
893122631bfe drm/i915/skl+: refactor WM calculation for NV12
91b92e255099 drm/i915/skl+: rename skl_wm_values struct to skl_ddb_values
---- Possible new issues:

Test kms_frontbuffer_tracking:
        Subgroup fbcpsr-1p-primscrn-shrfb-msflip-blt:
                fail       -> SKIP       (shard-snb)

---- Known issues:

Test kms_flip:
        Subgroup flip-vs-blocking-wf-vblank:
                pass       -> FAIL       (shard-hsw) fdo#100368 +3
Test kms_plane_multiple:
        Subgroup atomic-pipe-a-tiling-x:
                fail       -> PASS       (shard-snb) fdo#103166
Test kms_rotation_crc:
        Subgroup cursor-rotation-180:
                pass       -> FAIL       (shard-apl) fdo#103925 +1
Test kms_setmode:
        Subgroup basic:
                pass       -> FAIL       (shard-apl) fdo#99912
Test perf:
        Subgroup blocking:
                fail       -> PASS       (shard-hsw) fdo#102252

fdo#100368 https://bugs.freedesktop.org/show_bug.cgi?id=100368
fdo#103166 https://bugs.freedesktop.org/show_bug.cgi?id=103166
fdo#103925 https://bugs.freedesktop.org/show_bug.cgi?id=103925
fdo#99912 https://bugs.freedesktop.org/show_bug.cgi?id=99912
fdo#102252 https://bugs.freedesktop.org/show_bug.cgi?id=102252

shard-apl        total:2680 pass:1834 dwarn:1   dfail:0   fail:8   skip:836 time:12623s
shard-hsw        total:2680 pass:1782 dwarn:1   dfail:0   fail:5   skip:891 time:11220s
shard-snb        total:2680 pass:1378 dwarn:1   dfail:0   fail:2   skip:1299 time:6936s
Blacklisted hosts:
shard-kbl        total:2002 pass:1453 dwarn:1   dfail:0   fail:6   skip:542 time:6920s

Patches download mbox

Tests

Series 38919v28 Add NV12 support
https://patchwork.freedesktop.org/api/1.0/series/38919/revisions/28/mbox/

---- Possible new issues:

Test drv_module_reload:
        Subgroup basic-no-display:
                incomplete -> PASS       (fi-elk-e7500)

---- Known issues:

Test kms_pipe_crc_basic:
        Subgroup suspend-read-crc-pipe-c:
                incomplete -> PASS       (fi-bxt-dsi) fdo#103927

fdo#103927 https://bugs.freedesktop.org/show_bug.cgi?id=103927

fi-bdw-5557u     total:285  pass:264  dwarn:0   dfail:0   fail:0   skip:21  time:431s
fi-bdw-gvtdvm    total:285  pass:261  dwarn:0   dfail:0   fail:0   skip:24  time:447s
fi-blb-e6850     total:285  pass:220  dwarn:1   dfail:0   fail:0   skip:64  time:382s
fi-bsw-n3050     total:285  pass:239  dwarn:0   dfail:0   fail:0   skip:46  time:534s
fi-bwr-2160      total:285  pass:180  dwarn:0   dfail:0   fail:0   skip:105 time:298s
fi-bxt-dsi       total:285  pass:255  dwarn:0   dfail:0   fail:0   skip:30  time:517s
fi-bxt-j4205     total:285  pass:256  dwarn:0   dfail:0   fail:0   skip:29  time:519s
fi-byt-j1900     total:285  pass:250  dwarn:0   dfail:0   fail:0   skip:35  time:519s
fi-byt-n2820     total:285  pass:246  dwarn:0   dfail:0   fail:0   skip:39  time:506s
fi-cfl-8700k     total:285  pass:257  dwarn:0   dfail:0   fail:0   skip:28  time:411s
fi-cfl-s3        total:285  pass:259  dwarn:0   dfail:0   fail:0   skip:26  time:564s
fi-cfl-u         total:285  pass:259  dwarn:0   dfail:0   fail:0   skip:26  time:513s
fi-cnl-y3        total:285  pass:259  dwarn:0   dfail:0   fail:0   skip:26  time:590s
fi-elk-e7500     total:285  pass:226  dwarn:0   dfail:0   fail:0   skip:59  time:425s
fi-gdg-551       total:285  pass:176  dwarn:0   dfail:0   fail:1   skip:108 time:315s
fi-glk-1         total:285  pass:257  dwarn:0   dfail:0   fail:0   skip:28  time:542s
fi-glk-j4005     total:285  pass:256  dwarn:0   dfail:0   fail:0   skip:29  time:486s
fi-hsw-4770      total:285  pass:258  dwarn:0   dfail:0   fail:0   skip:27  time:410s
fi-ilk-650       total:285  pass:225  dwarn:0   dfail:0   fail:0   skip:60  time:424s
fi-ivb-3520m     total:285  pass:256  dwarn:0   dfail:0   fail:0   skip:29  time:467s
fi-ivb-3770      total:285  pass:252  dwarn:0   dfail:0   fail:0   skip:33  time:433s
fi-kbl-7500u     total:285  pass:260  dwarn:1   dfail:0   fail:0   skip:24  time:471s
fi-kbl-7567u     total:285  pass:265  dwarn:0   dfail:0   fail:0   skip:20  time:463s
fi-kbl-r         total:285  pass:258  dwarn:0   dfail:0   fail:0   skip:27  time:509s
fi-pnv-d510      total:285  pass:220  dwarn:1   dfail:0   fail:0   skip:64  time:665s
fi-skl-6260u     total:285  pass:265  dwarn:0   dfail:0   fail:0   skip:20  time:441s
fi-skl-6600u     total:285  pass:258  dwarn:0   dfail:0   fail:0   skip:27  time:536s
fi-skl-6700k2    total:285  pass:261  dwarn:0   dfail:0   fail:0   skip:24  time:504s
fi-skl-6770hq    total:285  pass:265  dwarn:0   dfail:0   fail:0   skip:20  time:499s
fi-skl-guc       total:285  pass:257  dwarn:0   dfail:0   fail:0   skip:28  time:430s
fi-skl-gvtdvm    total:285  pass:262  dwarn:0   dfail:0   fail:0   skip:23  time:446s
fi-snb-2520m     total:285  pass:245  dwarn:0   dfail:0   fail:0   skip:40  time:590s
fi-snb-2600      total:285  pass:245  dwarn:0   dfail:0   fail:0   skip:40  time:401s

3cbdbfb1ecc8769c8db88e95b1d6ea55c5e87dbf drm-tip: 2018y-04m-06d-15h-15m-21s UTC integration manifest
f4780d4dd5df drm/i915: Do not do fb src adjustments for NV12
06abcbaf640b drm/i915: Add NV12 support to intel_framebuffer_init
9252f314de7f drm/i915: Add NV12 as supported format for sprite plane
58a5f7535342 drm/i915: Add NV12 as supported format for primary plane
129a6d65d276 drm/i915: Upscale scaler max scale for NV12
e829073a9209 drm/i915: Update format_is_yuv() to include NV12
f13540bfda9f drm/i915: Set scaler mode for NV12
1dbe2d87fea9 drm/i915: Enable YUV to RGB for Gen10 in Plane Ctrl Reg
8ce9f755dc35 drm/i915: Display WA 827
724da9ae7746 drm/i915/skl: split skl_compute_ddb function
604748f2f55d drm/i915/skl+: nv12 workaround disable WM level 1-7
644ad0c54532 drm/i915/skl+: make sure higher latency level has higher wm value
b3a2c21251fa drm/i915/skl+: pass skl_wm_level struct to wm compute func
a4ad4d458dad drm/i915/skl+: NV12 related changes for WM
8bbb9d246ed4 drm/i915/skl+: support verification of DDB HW state for NV12
974cb8c8f905 drm/i915/skl+: add NV12 in skl_format_to_fourcc
3dfaac8faabe drm/i915/skl+: refactor WM calculation for NV12
6b6602e4f05a drm/i915/skl+: rename skl_wm_values struct to skl_ddb_values
---- Possible new issues:

Test gem_mmap_gtt:
        Subgroup forked-medium-copy-odd:
                dmesg-warn -> PASS       (shard-hsw)
Test kms_frontbuffer_tracking:
        Subgroup fbc-2p-pri-indfb-multidraw:
                dmesg-fail -> PASS       (shard-hsw)

---- Known issues:

Test kms_cursor_legacy:
        Subgroup 2x-long-flip-vs-cursor-legacy:
                fail       -> PASS       (shard-hsw) fdo#104873
Test kms_flip:
        Subgroup 2x-flip-vs-expired-vblank:
                fail       -> PASS       (shard-hsw) fdo#102887
        Subgroup 2x-plain-flip-fb-recreate:
                pass       -> FAIL       (shard-hsw) fdo#100368 +1
Test kms_rotation_crc:
        Subgroup primary-rotation-180:
                pass       -> FAIL       (shard-snb) fdo#103925
Test kms_vblank:
        Subgroup pipe-c-accuracy-idle:
                pass       -> FAIL       (shard-hsw) fdo#102583

fdo#104873 https://bugs.freedesktop.org/show_bug.cgi?id=104873
fdo#102887 https://bugs.freedesktop.org/show_bug.cgi?id=102887
fdo#100368 https://bugs.freedesktop.org/show_bug.cgi?id=100368
fdo#103925 https://bugs.freedesktop.org/show_bug.cgi?id=103925
fdo#102583 https://bugs.freedesktop.org/show_bug.cgi?id=102583

shard-apl        total:2680 pass:1835 dwarn:1   dfail:0   fail:7   skip:836 time:12615s
shard-hsw        total:2680 pass:1783 dwarn:1   dfail:0   fail:4   skip:891 time:11307s
shard-snb        total:2680 pass:1377 dwarn:1   dfail:0   fail:3   skip:1299 time:6817s
Blacklisted hosts:
shard-kbl        total:2680 pass:1963 dwarn:1   dfail:0   fail:7   skip:709 time:9195s

Patches download mbox

Tests

Series 38919v29 Add NV12 support
https://patchwork.freedesktop.org/api/1.0/series/38919/revisions/29/mbox/

---- Possible new issues:

Test gem_ctx_switch:
        Subgroup basic-default:
                pass       -> INCOMPLETE (fi-cnl-y3)

---- Known issues:

Test kms_pipe_crc_basic:
        Subgroup suspend-read-crc-pipe-c:
                pass       -> INCOMPLETE (fi-bxt-dsi) fdo#103927

fdo#103927 https://bugs.freedesktop.org/show_bug.cgi?id=103927

fi-bdw-5557u     total:285  pass:264  dwarn:0   dfail:0   fail:0   skip:21  time:431s
fi-bdw-gvtdvm    total:285  pass:261  dwarn:0   dfail:0   fail:0   skip:24  time:446s
fi-blb-e6850     total:285  pass:220  dwarn:1   dfail:0   fail:0   skip:64  time:382s
fi-bsw-n3050     total:285  pass:239  dwarn:0   dfail:0   fail:0   skip:46  time:544s
fi-bwr-2160      total:285  pass:180  dwarn:0   dfail:0   fail:0   skip:105 time:299s
fi-bxt-dsi       total:243  pass:216  dwarn:0   dfail:0   fail:0   skip:26 
fi-bxt-j4205     total:285  pass:256  dwarn:0   dfail:0   fail:0   skip:29  time:510s
fi-byt-j1900     total:285  pass:250  dwarn:0   dfail:0   fail:0   skip:35  time:518s
fi-byt-n2820     total:285  pass:246  dwarn:0   dfail:0   fail:0   skip:39  time:505s
fi-cfl-8700k     total:285  pass:257  dwarn:0   dfail:0   fail:0   skip:28  time:409s
fi-cfl-s3        total:285  pass:259  dwarn:0   dfail:0   fail:0   skip:26  time:559s
fi-cfl-u         total:285  pass:259  dwarn:0   dfail:0   fail:0   skip:26  time:511s
fi-cnl-y3        total:21   pass:20   dwarn:0   dfail:0   fail:0   skip:0  
fi-elk-e7500     total:285  pass:226  dwarn:0   dfail:0   fail:0   skip:59  time:422s
fi-gdg-551       total:285  pass:177  dwarn:0   dfail:0   fail:0   skip:108 time:316s
fi-glk-1         total:285  pass:257  dwarn:0   dfail:0   fail:0   skip:28  time:537s
fi-glk-j4005     total:285  pass:256  dwarn:0   dfail:0   fail:0   skip:29  time:485s
fi-hsw-4770      total:285  pass:258  dwarn:0   dfail:0   fail:0   skip:27  time:406s
fi-ilk-650       total:285  pass:225  dwarn:0   dfail:0   fail:0   skip:60  time:421s
fi-ivb-3520m     total:285  pass:256  dwarn:0   dfail:0   fail:0   skip:29  time:460s
fi-ivb-3770      total:285  pass:252  dwarn:0   dfail:0   fail:0   skip:33  time:443s
fi-kbl-7500u     total:285  pass:260  dwarn:1   dfail:0   fail:0   skip:24  time:472s
fi-kbl-7567u     total:285  pass:265  dwarn:0   dfail:0   fail:0   skip:20  time:463s
fi-kbl-r         total:285  pass:258  dwarn:0   dfail:0   fail:0   skip:27  time:509s
fi-pnv-d510      total:285  pass:220  dwarn:1   dfail:0   fail:0   skip:64  time:663s
fi-skl-6260u     total:285  pass:265  dwarn:0   dfail:0   fail:0   skip:20  time:438s
fi-skl-6600u     total:285  pass:258  dwarn:0   dfail:0   fail:0   skip:27  time:533s
fi-skl-6700k2    total:285  pass:261  dwarn:0   dfail:0   fail:0   skip:24  time:507s
fi-skl-6770hq    total:285  pass:265  dwarn:0   dfail:0   fail:0   skip:20  time:503s
fi-skl-guc       total:285  pass:257  dwarn:0   dfail:0   fail:0   skip:28  time:431s
fi-skl-gvtdvm    total:285  pass:262  dwarn:0   dfail:0   fail:0   skip:23  time:441s
fi-snb-2520m     total:285  pass:245  dwarn:0   dfail:0   fail:0   skip:40  time:581s
fi-snb-2600      total:285  pass:245  dwarn:0   dfail:0   fail:0   skip:40  time:399s

81dedad1abdea28e13cede1ad289b36b6b5ee3bc drm-tip: 2018y-04m-07d-08h-54m-23s UTC integration manifest
fa06f27a3cdb drm/i915: Do not do fb src adjustments for NV12
41d1a3c2192f drm/i915: Reuse code from check_sprite for primary as well
f6ab3b609b23 drm/i915: Add NV12 support to intel_framebuffer_init
4c5429e8235c drm/i915: Add NV12 as supported format for sprite plane
d9b0aeb44fc3 drm/i915: Add NV12 as supported format for primary plane
65d30f7c4608 drm/i915: Upscale scaler max scale for NV12
7fdbf23af76d drm/i915: Update format_is_yuv() to include NV12
d6b92f920a91 drm/i915: Set scaler mode for NV12
4f84590179c1 drm/i915: Enable YUV to RGB for Gen10 in Plane Ctrl Reg
33ec73eb2004 drm/i915: Display WA 827
b3a797f21131 drm/i915/skl: split skl_compute_ddb function
683fe3a9d4c6 drm/i915/skl+: nv12 workaround disable WM level 1-7
14e7f197f780 drm/i915/skl+: make sure higher latency level has higher wm value
9b0feab7690c drm/i915/skl+: pass skl_wm_level struct to wm compute func
3765cca2bb82 drm/i915/skl+: NV12 related changes for WM
691f29620b8d drm/i915/skl+: support verification of DDB HW state for NV12
ee2fa316deee drm/i915/skl+: add NV12 in skl_format_to_fourcc
e79d0e012bc9 drm/i915/skl+: refactor WM calculation for NV12
2983aa96e3de drm/i915/skl+: rename skl_wm_values struct to skl_ddb_values
SERIES REVISION LOOKS STRANGE. Please double-check patch list and the ordering before proceeding.

Patches download mbox

SERIES REVISION LOOKS STRANGE. Please double-check patch list and the ordering before proceeding.

Patches download mbox

Patches download mbox

Tests

Series 38919v32 Add NV12 support
https://patchwork.freedesktop.org/api/1.0/series/38919/revisions/32/mbox/

---- Possible new issues:

Test gem_exec_flush:
        Subgroup basic-uc-pro-default:
                pass       -> INCOMPLETE (fi-cnl-y3)

---- Known issues:

Test debugfs_test:
        Subgroup read_all_entries:
                pass       -> INCOMPLETE (fi-snb-2520m) fdo#103713
Test gem_mmap_gtt:
        Subgroup basic-small-bo-tiledx:
                pass       -> FAIL       (fi-gdg-551) fdo#102575
Test kms_flip:
        Subgroup basic-flip-vs-wf_vblank:
                pass       -> FAIL       (fi-cfl-s3) fdo#100368
Test kms_pipe_crc_basic:
        Subgroup suspend-read-crc-pipe-c:
                pass       -> INCOMPLETE (fi-bxt-dsi) fdo#103927

fdo#103713 https://bugs.freedesktop.org/show_bug.cgi?id=103713
fdo#102575 https://bugs.freedesktop.org/show_bug.cgi?id=102575
fdo#100368 https://bugs.freedesktop.org/show_bug.cgi?id=100368
fdo#103927 https://bugs.freedesktop.org/show_bug.cgi?id=103927

fi-bdw-5557u     total:285  pass:264  dwarn:0   dfail:0   fail:0   skip:21  time:432s
fi-bdw-gvtdvm    total:285  pass:261  dwarn:0   dfail:0   fail:0   skip:24  time:441s
fi-blb-e6850     total:285  pass:220  dwarn:1   dfail:0   fail:0   skip:64  time:384s
fi-bsw-n3050     total:285  pass:239  dwarn:0   dfail:0   fail:0   skip:46  time:536s
fi-bwr-2160      total:285  pass:180  dwarn:0   dfail:0   fail:0   skip:105 time:298s
fi-bxt-dsi       total:243  pass:216  dwarn:0   dfail:0   fail:0   skip:26 
fi-bxt-j4205     total:285  pass:256  dwarn:0   dfail:0   fail:0   skip:29  time:518s
fi-byt-j1900     total:285  pass:250  dwarn:0   dfail:0   fail:0   skip:35  time:517s
fi-byt-n2820     total:285  pass:246  dwarn:0   dfail:0   fail:0   skip:39  time:507s
fi-cfl-8700k     total:285  pass:257  dwarn:0   dfail:0   fail:0   skip:28  time:413s
fi-cfl-s3        total:285  pass:258  dwarn:0   dfail:0   fail:1   skip:26  time:557s
fi-cfl-u         total:285  pass:259  dwarn:0   dfail:0   fail:0   skip:26  time:512s
fi-cnl-y3        total:53   pass:45   dwarn:0   dfail:0   fail:0   skip:7  
fi-elk-e7500     total:285  pass:226  dwarn:0   dfail:0   fail:0   skip:59  time:422s
fi-gdg-551       total:285  pass:176  dwarn:0   dfail:0   fail:1   skip:108 time:313s
fi-glk-1         total:285  pass:257  dwarn:0   dfail:0   fail:0   skip:28  time:534s
fi-glk-j4005     total:285  pass:256  dwarn:0   dfail:0   fail:0   skip:29  time:484s
fi-hsw-4770      total:285  pass:258  dwarn:0   dfail:0   fail:0   skip:27  time:406s
fi-ilk-650       total:285  pass:225  dwarn:0   dfail:0   fail:0   skip:60  time:421s
fi-ivb-3520m     total:285  pass:256  dwarn:0   dfail:0   fail:0   skip:29  time:471s
fi-ivb-3770      total:285  pass:252  dwarn:0   dfail:0   fail:0   skip:33  time:446s
fi-kbl-7500u     total:285  pass:260  dwarn:1   dfail:0   fail:0   skip:24  time:476s
fi-kbl-7567u     total:285  pass:265  dwarn:0   dfail:0   fail:0   skip:20  time:462s
fi-kbl-r         total:285  pass:258  dwarn:0   dfail:0   fail:0   skip:27  time:509s
fi-pnv-d510      total:285  pass:220  dwarn:1   dfail:0   fail:0   skip:64  time:664s
fi-skl-6260u     total:285  pass:265  dwarn:0   dfail:0   fail:0   skip:20  time:439s
fi-skl-6600u     total:285  pass:258  dwarn:0   dfail:0   fail:0   skip:27  time:542s
fi-skl-6700k2    total:285  pass:261  dwarn:0   dfail:0   fail:0   skip:24  time:505s
fi-skl-6770hq    total:285  pass:265  dwarn:0   dfail:0   fail:0   skip:20  time:502s
fi-skl-guc       total:285  pass:257  dwarn:0   dfail:0   fail:0   skip:28  time:431s
fi-skl-gvtdvm    total:285  pass:262  dwarn:0   dfail:0   fail:0   skip:23  time:450s
fi-snb-2520m     total:3    pass:2    dwarn:0   dfail:0   fail:0   skip:0  
fi-snb-2600      total:285  pass:245  dwarn:0   dfail:0   fail:0   skip:40  time:406s

81dedad1abdea28e13cede1ad289b36b6b5ee3bc drm-tip: 2018y-04m-07d-08h-54m-23s UTC integration manifest
4e09a8663b94 drm/i915: Do not do fb src adjustments for NV12
788cad0f276b drm/i915: Reuse code from check_sprite for primary as well
272a1e28269d drm/i915: Add NV12 support to intel_framebuffer_init
49677165c9cb drm/i915: Add NV12 as supported format for sprite plane
5702d492fd71 drm/i915: Add NV12 as supported format for primary plane
6bc8d75d618f drm/i915: Upscale scaler max scale for NV12
42c3de556487 drm/i915: Update format_is_yuv() to include NV12
5d74681f60a9 drm/i915: Set scaler mode for NV12
2679f625dfe7 drm/i915: Enable YUV to RGB for Gen10 in Plane Ctrl Reg
427ed5befeae drm/i915: Display WA 827
1a2afc0261fc drm/i915/skl: split skl_compute_ddb function
d15574d96baf drm/i915/skl+: nv12 workaround disable WM level 1-7
fa10c72ed472 drm/i915/skl+: make sure higher latency level has higher wm value
56117c125f77 drm/i915/skl+: pass skl_wm_level struct to wm compute func
969c1e796d67 drm/i915/skl+: NV12 related changes for WM
7ec7d1b0dedd drm/i915/skl+: support verification of DDB HW state for NV12
7de92ae2bd5f drm/i915/skl+: add NV12 in skl_format_to_fourcc
ae63c7b31dbf drm/i915/skl+: refactor WM calculation for NV12
916352df146d drm/i915/skl+: rename skl_wm_values struct to skl_ddb_values

Patches download mbox

Tests

Series 38919v33 Add NV12 support
https://patchwork.freedesktop.org/api/1.0/series/38919/revisions/33/mbox/

---- Known issues:

Test debugfs_test:
        Subgroup read_all_entries:
                incomplete -> PASS       (fi-snb-2520m) fdo#103713
Test gem_mmap_gtt:
        Subgroup basic-small-bo-tiledx:
                fail       -> PASS       (fi-gdg-551) fdo#102575
Test kms_chamelium:
        Subgroup dp-edid-read:
                fail       -> PASS       (fi-kbl-7500u) fdo#102505
Test kms_flip:
        Subgroup basic-flip-vs-wf_vblank:
                fail       -> PASS       (fi-cfl-s3) fdo#100368
Test kms_pipe_crc_basic:
        Subgroup suspend-read-crc-pipe-c:
                pass       -> INCOMPLETE (fi-bxt-dsi) fdo#103927

fdo#103713 https://bugs.freedesktop.org/show_bug.cgi?id=103713
fdo#102575 https://bugs.freedesktop.org/show_bug.cgi?id=102575
fdo#102505 https://bugs.freedesktop.org/show_bug.cgi?id=102505
fdo#100368 https://bugs.freedesktop.org/show_bug.cgi?id=100368
fdo#103927 https://bugs.freedesktop.org/show_bug.cgi?id=103927

fi-bdw-5557u     total:285  pass:264  dwarn:0   dfail:0   fail:0   skip:21  time:431s
fi-bdw-gvtdvm    total:285  pass:261  dwarn:0   dfail:0   fail:0   skip:24  time:448s
fi-blb-e6850     total:285  pass:220  dwarn:1   dfail:0   fail:0   skip:64  time:383s
fi-bsw-n3050     total:285  pass:239  dwarn:0   dfail:0   fail:0   skip:46  time:542s
fi-bwr-2160      total:285  pass:180  dwarn:0   dfail:0   fail:0   skip:105 time:296s
fi-bxt-dsi       total:243  pass:216  dwarn:0   dfail:0   fail:0   skip:26 
fi-bxt-j4205     total:285  pass:256  dwarn:0   dfail:0   fail:0   skip:29  time:515s
fi-byt-j1900     total:285  pass:250  dwarn:0   dfail:0   fail:0   skip:35  time:520s
fi-byt-n2820     total:285  pass:246  dwarn:0   dfail:0   fail:0   skip:39  time:507s
fi-cfl-8700k     total:285  pass:257  dwarn:0   dfail:0   fail:0   skip:28  time:412s
fi-cfl-s3        total:285  pass:259  dwarn:0   dfail:0   fail:0   skip:26  time:561s
fi-cfl-u         total:285  pass:259  dwarn:0   dfail:0   fail:0   skip:26  time:512s
fi-cnl-y3        total:20   pass:19   dwarn:0   dfail:0   fail:0   skip:0  
fi-elk-e7500     total:285  pass:226  dwarn:0   dfail:0   fail:0   skip:59  time:422s
fi-gdg-551       total:285  pass:177  dwarn:0   dfail:0   fail:0   skip:108 time:316s
fi-glk-1         total:285  pass:257  dwarn:0   dfail:0   fail:0   skip:28  time:538s
fi-glk-j4005     total:285  pass:256  dwarn:0   dfail:0   fail:0   skip:29  time:486s
fi-hsw-4770      total:285  pass:258  dwarn:0   dfail:0   fail:0   skip:27  time:402s
fi-ilk-650       total:285  pass:225  dwarn:0   dfail:0   fail:0   skip:60  time:424s
fi-ivb-3520m     total:285  pass:256  dwarn:0   dfail:0   fail:0   skip:29  time:464s
fi-ivb-3770      total:285  pass:252  dwarn:0   dfail:0   fail:0   skip:33  time:436s
fi-kbl-7500u     total:285  pass:260  dwarn:1   dfail:0   fail:0   skip:24  time:473s
fi-kbl-7567u     total:285  pass:265  dwarn:0   dfail:0   fail:0   skip:20  time:472s
fi-kbl-r         total:285  pass:258  dwarn:0   dfail:0   fail:0   skip:27  time:513s
fi-pnv-d510      total:285  pass:220  dwarn:1   dfail:0   fail:0   skip:64  time:671s
fi-skl-6260u     total:285  pass:265  dwarn:0   dfail:0   fail:0   skip:20  time:445s
fi-skl-6600u     total:285  pass:258  dwarn:0   dfail:0   fail:0   skip:27  time:536s
fi-skl-6700k2    total:285  pass:261  dwarn:0   dfail:0   fail:0   skip:24  time:502s
fi-skl-6770hq    total:285  pass:265  dwarn:0   dfail:0   fail:0   skip:20  time:496s
fi-skl-guc       total:285  pass:257  dwarn:0   dfail:0   fail:0   skip:28  time:426s
fi-skl-gvtdvm    total:285  pass:262  dwarn:0   dfail:0   fail:0   skip:23  time:443s
fi-snb-2520m     total:285  pass:245  dwarn:0   dfail:0   fail:0   skip:40  time:576s
fi-snb-2600      total:285  pass:245  dwarn:0   dfail:0   fail:0   skip:40  time:398s

1be073153147c5c39cdcbdfdeb4e2595ba595bf7 drm-tip: 2018y-04m-07d-22h-26m-31s UTC integration manifest
926640c2571b drm/i915: Do not do fb src adjustments for NV12
2bbe9a84e36b drm/i915: Reuse code from check_sprite for primary as well
deba4256b191 drm/i915: Add NV12 support to intel_framebuffer_init
c3ccc86b17af drm/i915: Add NV12 as supported format for sprite plane
68b96766c63a drm/i915: Add NV12 as supported format for primary plane
d299ca745c7c drm/i915: Upscale scaler max scale for NV12
53f61cf40f92 drm/i915: Update format_is_yuv() to include NV12
fa240c480d49 drm/i915: Set scaler mode for NV12
8991a71c9876 drm/i915: Enable YUV to RGB for Gen10 in Plane Ctrl Reg
45e034bbf919 drm/i915: Display WA 827
ed92bbb8ed2a drm/i915/skl: split skl_compute_ddb function
5a9cddf03f34 drm/i915/skl+: nv12 workaround disable WM level 1-7
5494f089a459 drm/i915/skl+: make sure higher latency level has higher wm value
c0c9c1462a90 drm/i915/skl+: pass skl_wm_level struct to wm compute func
e9b0ee3ce463 drm/i915/skl+: NV12 related changes for WM
637293859902 drm/i915/skl+: support verification of DDB HW state for NV12
9c4f0bf8768d drm/i915/skl+: add NV12 in skl_format_to_fourcc
76101200b296 drm/i915/skl+: refactor WM calculation for NV12
078b18871087 drm/i915/skl+: rename skl_wm_values struct to skl_ddb_values
---- Possible new issues:

Test gem_pwrite:
        Subgroup big-gtt-backwards:
                skip       -> PASS       (shard-apl)
Test kms_atomic:
        Subgroup plane_overlay_legacy:
                pass       -> FAIL       (shard-hsw)
                pass       -> FAIL       (shard-snb)
Test kms_atomic_transition:
        Subgroup plane-all-modeset-transition:
                pass       -> FAIL       (shard-hsw)
                pass       -> FAIL       (shard-snb)
        Subgroup plane-all-modeset-transition-fencing:
                pass       -> FAIL       (shard-snb)
        Subgroup plane-all-transition:
                pass       -> FAIL       (shard-hsw)
                pass       -> FAIL       (shard-snb)
        Subgroup plane-all-transition-fencing:
                pass       -> FAIL       (shard-hsw)
                pass       -> FAIL       (shard-snb)
        Subgroup plane-all-transition-nonblocking:
                pass       -> FAIL       (shard-hsw)
                pass       -> FAIL       (shard-snb)
        Subgroup plane-all-transition-nonblocking-fencing:
                pass       -> FAIL       (shard-hsw)
                pass       -> FAIL       (shard-snb)
        Subgroup plane-toggle-modeset-transition:
                pass       -> FAIL       (shard-hsw)
                pass       -> FAIL       (shard-snb)
        Subgroup plane-use-after-nonblocking-unbind:
                pass       -> FAIL       (shard-hsw)
                pass       -> FAIL       (shard-snb)
        Subgroup plane-use-after-nonblocking-unbind-fencing:
                pass       -> FAIL       (shard-hsw)
                pass       -> FAIL       (shard-snb)
Test kms_concurrent:
        Subgroup pipe-a:
                pass       -> FAIL       (shard-hsw)
                pass       -> FAIL       (shard-snb)
        Subgroup pipe-b:
                pass       -> FAIL       (shard-hsw)
                pass       -> FAIL       (shard-snb)
        Subgroup pipe-c:
                pass       -> FAIL       (shard-hsw)
Test kms_frontbuffer_tracking:
        Subgroup fbc-1p-primscrn-spr-indfb-draw-blt:
                pass       -> FAIL       (shard-hsw)
        Subgroup fbc-1p-primscrn-spr-indfb-draw-mmap-cpu:
                pass       -> FAIL       (shard-hsw)
        Subgroup fbc-1p-primscrn-spr-indfb-draw-mmap-gtt:
                pass       -> FAIL       (shard-hsw)
        Subgroup fbc-1p-primscrn-spr-indfb-draw-mmap-wc:
                pass       -> FAIL       (shard-hsw)
                pass       -> FAIL       (shard-snb)
        Subgroup fbc-1p-primscrn-spr-indfb-draw-pwrite:
                pass       -> FAIL       (shard-hsw)
        Subgroup fbc-1p-primscrn-spr-indfb-fullscreen:
                pass       -> FAIL       (shard-hsw)
        Subgroup fbc-1p-primscrn-spr-indfb-move:
                pass       -> FAIL       (shard-hsw)
                pass       -> FAIL       (shard-snb)
        Subgroup fbc-1p-primscrn-spr-indfb-onoff:
                pass       -> FAIL       (shard-hsw)
        Subgroup fbc-1p-rte:
                pass       -> FAIL       (shard-hsw)
        Subgroup fbc-2p-primscrn-spr-indfb-draw-blt:
                pass       -> FAIL       (shard-hsw)
        Subgroup fbc-2p-primscrn-spr-indfb-draw-mmap-cpu:
                pass       -> FAIL       (shard-hsw)
        Subgroup fbc-2p-primscrn-spr-indfb-draw-mmap-gtt:
                pass       -> FAIL       (shard-hsw)
        Subgroup fbc-2p-primscrn-spr-indfb-draw-mmap-wc:
                pass       -> FAIL       (shard-hsw)
        Subgroup fbc-2p-primscrn-spr-indfb-draw-pwrite:
                pass       -> FAIL       (shard-hsw)
        Subgroup fbc-2p-primscrn-spr-indfb-draw-render:
                pass       -> FAIL       (shard-hsw)
        Subgroup fbc-2p-primscrn-spr-indfb-fullscreen:
                pass       -> FAIL       (shard-hsw)
        Subgroup fbc-2p-primscrn-spr-indfb-move:
                pass       -> FAIL       (shard-hsw)
        Subgroup fbc-2p-primscrn-spr-indfb-onoff:
                pass       -> FAIL       (shard-hsw)
        Subgroup fbc-2p-rte:
                pass       -> FAIL       (shard-hsw)
        Subgroup fbc-2p-scndscrn-spr-indfb-draw-blt:
                pass       -> FAIL       (shard-hsw)
        Subgroup fbc-2p-scndscrn-spr-indfb-draw-mmap-cpu:
                pass       -> FAIL       (shard-hsw)
        Subgroup fbc-2p-scndscrn-spr-indfb-draw-mmap-gtt:
                pass       -> FAIL       (shard-hsw)
        Subgroup fbc-2p-scndscrn-spr-indfb-draw-mmap-wc:
                pass       -> FAIL       (shard-hsw)
        Subgroup fbc-2p-scndscrn-spr-indfb-draw-pwrite:
                pass       -> FAIL       (shard-hsw)
        Subgroup fbc-2p-scndscrn-spr-indfb-draw-render:
                pass       -> FAIL       (shard-hsw)
        Subgroup fbc-2p-scndscrn-spr-indfb-fullscreen:
                pass       -> FAIL       (shard-hsw)
        Subgroup fbc-2p-scndscrn-spr-indfb-move:
                pass       -> FAIL       (shard-hsw)
        Subgroup fbc-2p-scndscrn-spr-indfb-onoff:
                pass       -> FAIL       (shard-hsw)
Test kms_plane:
        Subgroup plane-position-covered-pipe-b-planes:
                pass       -> FAIL       (shard-hsw)
                pass       -> FAIL       (shard-snb)
        Subgroup plane-position-covered-pipe-c-planes:
                pass       -> FAIL       (shard-hsw)
        Subgroup plane-position-hole-dpms-pipe-c-planes:
                pass       -> FAIL       (shard-hsw)
Test kms_plane_lowres:
        Subgroup pipe-a-tiling-none:
                pass       -> SKIP       (shard-hsw)
                pass       -> SKIP       (shard-snb)
        Subgroup pipe-b-tiling-x:
                pass       -> SKIP       (shard-hsw)
                pass       -> SKIP       (shard-snb)
Test kms_plane_multiple:
        Subgroup atomic-pipe-b-tiling-x:
                pass       -> FAIL       (shard-hsw)
                pass       -> FAIL       (shard-snb)
Test kms_plane_scaling:
        Subgroup pipe-a-scaler-with-clipping-clamping:
                pass       -> DMESG-WARN (shard-apl)
        Subgroup pipe-b-scaler-with-clipping-clamping:
                pass       -> DMESG-WARN (shard-apl)
Test kms_universal_plane:
        Subgroup universal-plane-pipe-a-sanity:
                pass       -> FAIL       (shard-hsw)
        Subgroup universal-plane-pipe-b-functional:
                pass       -> FAIL       (shard-hsw)
                pass       -> FAIL       (shard-snb)
        Subgroup universal-plane-pipe-b-sanity:
                pass       -> FAIL       (shard-hsw)
                pass       -> FAIL       (shard-snb)
        Subgroup universal-plane-pipe-c-functional:
                pass       -> FAIL       (shard-hsw)
        Subgroup universal-plane-pipe-c-sanity:
                pass       -> FAIL       (shard-hsw)
Test pm_rpm:
        Subgroup legacy-planes:
                pass       -> FAIL       (shard-hsw)
        Subgroup legacy-planes-dpms:
                pass       -> FAIL       (shard-hsw)
        Subgroup universal-planes:
                pass       -> FAIL       (shard-hsw)
        Subgroup universal-planes-dpms:
                pass       -> FAIL       (shard-hsw)

---- Known issues:

Test kms_flip:
        Subgroup 2x-flip-vs-expired-vblank-interruptible:
                fail       -> PASS       (shard-hsw) fdo#102887 +1
        Subgroup 2x-plain-flip-fb-recreate:
                fail       -> PASS       (shard-hsw) fdo#100368
Test kms_frontbuffer_tracking:
        Subgroup fbc-1p-primscrn-spr-indfb-draw-mmap-gtt:
                pass       -> FAIL       (shard-snb) fdo#103167 +7
        Subgroup fbc-1p-primscrn-spr-indfb-draw-render:
                pass       -> FAIL       (shard-hsw) fdo#102614 +1
Test kms_plane:
        Subgroup plane-position-hole-dpms-pipe-b-planes:
                pass       -> FAIL       (shard-snb) fdo#103166 +21
Test kms_rotation_crc:
        Subgroup sprite-rotation-180:
                pass       -> FAIL       (shard-snb) fdo#103925 +1
Test kms_sysfs_edid_timing:
                pass       -> WARN       (shard-apl) fdo#100047
Test kms_universal_plane:
        Subgroup universal-plane-pipe-a-sanity:
                pass       -> FAIL       (shard-snb) fdo#105798
Test kms_vblank:
        Subgroup pipe-c-accuracy-idle:
                pass       -> FAIL       (shard-hsw) fdo#102583

fdo#102887 https://bugs.freedesktop.org/show_bug.cgi?id=102887
fdo#100368 https://bugs.freedesktop.org/show_bug.cgi?id=100368
fdo#103167 https://bugs.freedesktop.org/show_bug.cgi?id=103167
fdo#102614 https://bugs.freedesktop.org/show_bug.cgi?id=102614
fdo#103166 https://bugs.freedesktop.org/show_bug.cgi?id=103166
fdo#103925 https://bugs.freedesktop.org/show_bug.cgi?id=103925
fdo#100047 https://bugs.freedesktop.org/show_bug.cgi?id=100047
fdo#105798 https://bugs.freedesktop.org/show_bug.cgi?id=105798
fdo#102583 https://bugs.freedesktop.org/show_bug.cgi?id=102583

shard-apl        total:2680 pass:1833 dwarn:3   dfail:0   fail:7   skip:836 time:12680s
shard-hsw        total:2680 pass:1713 dwarn:1   dfail:0   fail:68  skip:897 time:11301s
shard-snb        total:2680 pass:1338 dwarn:1   dfail:0   fail:38  skip:1303 time:6919s
Blacklisted hosts:
shard-kbl        total:2680 pass:1958 dwarn:3   dfail:0   fail:7   skip:712 time:9282s

Patches download mbox

Tests

CHK     include/config/kernel.release
  CHK     include/generated/uapi/linux/version.h
  CHK     include/generated/utsrelease.h
  CHK     include/generated/bounds.h
  CHK     include/generated/timeconst.h
  CHK     include/generated/asm-offsets.h
  CALL    scripts/checksyscalls.sh
  DESCEND  objtool
  CHK     scripts/mod/devicetable-offsets.h
  CHK     include/generated/compile.h
  CHK     kernel/config_data.h
  CC [M]  drivers/gpu/drm/i915/intel_atomic_plane.o
drivers/gpu/drm/i915/intel_atomic_plane.c: In function ‘intel_atomic_helper_check_plane_state’:
drivers/gpu/drm/i915/intel_atomic_plane.c:274:33: error: ‘src_h’ may be used uninitialized in this function [-Werror=maybe-uninitialized]
       (src_w != crtc_w || src_h != crtc_h)) {
                           ~~~~~~^~~~~~~~~
drivers/gpu/drm/i915/intel_atomic_plane.c:287:47: error: ‘src_w’ may be used uninitialized in this function [-Werror=maybe-uninitialized]
    width_bytes = ((src_x * cpp) & 63) + src_w * cpp;
                                         ~~~~~~^~~~~
drivers/gpu/drm/i915/intel_atomic_plane.c:307:21: error: ‘src_y’ may be used uninitialized in this function [-Werror=maybe-uninitialized]
    src->y2 = (src_y + src_h) << 16;
              ~~~~~~~^~~~~~~~
drivers/gpu/drm/i915/intel_atomic_plane.c:287:26: error: ‘src_x’ may be used uninitialized in this function [-Werror=maybe-uninitialized]
    width_bytes = ((src_x * cpp) & 63) + src_w * cpp;
                   ~~~~~~~^~~~~~
drivers/gpu/drm/i915/intel_atomic_plane.c:312:20: error: ‘crtc_h’ may be used uninitialized in this function [-Werror=maybe-uninitialized]
   dst->y2 = crtc_y + crtc_h;
             ~~~~~~~^~~~~~~~
drivers/gpu/drm/i915/intel_atomic_plane.c:263:13: error: ‘crtc_w’ may be used uninitialized in this function [-Werror=maybe-uninitialized]
      crtc_w &= ~1;
      ~~~~~~~^~~~~
drivers/gpu/drm/i915/intel_atomic_plane.c:312:20: error: ‘crtc_y’ may be used uninitialized in this function [-Werror=maybe-uninitialized]
   dst->y2 = crtc_y + crtc_h;
             ~~~~~~~^~~~~~~~
drivers/gpu/drm/i915/intel_atomic_plane.c:310:20: error: ‘crtc_x’ may be used uninitialized in this function [-Werror=maybe-uninitialized]
   dst->x2 = crtc_x + crtc_w;
             ~~~~~~~^~~~~~~~
cc1: all warnings being treated as errors
scripts/Makefile.build:324: recipe for target 'drivers/gpu/drm/i915/intel_atomic_plane.o' failed
make[4]: *** [drivers/gpu/drm/i915/intel_atomic_plane.o] Error 1
scripts/Makefile.build:583: recipe for target 'drivers/gpu/drm/i915' failed
make[3]: *** [drivers/gpu/drm/i915] Error 2
scripts/Makefile.build:583: recipe for target 'drivers/gpu/drm' failed
make[2]: *** [drivers/gpu/drm] Error 2
scripts/Makefile.build:583: recipe for target 'drivers/gpu' failed
make[1]: *** [drivers/gpu] Error 2
Makefile:1060: recipe for target 'drivers' failed
make: *** [drivers] Error 2

Patches download mbox

Tests

Series 38919v36 Add NV12 support
https://patchwork.freedesktop.org/api/1.0/series/38919/revisions/36/mbox/

---- Known issues:

Test debugfs_test:
        Subgroup read_all_entries:
                incomplete -> PASS       (fi-snb-2520m) fdo#103713 +1
Test gem_ctx_param:
        Subgroup basic-default:
                incomplete -> PASS       (fi-cnl-y3) fdo#105086
Test kms_flip:
        Subgroup basic-flip-vs-wf_vblank:
                fail       -> PASS       (fi-cfl-s3) fdo#100368

fdo#103713 https://bugs.freedesktop.org/show_bug.cgi?id=103713
fdo#105086 https://bugs.freedesktop.org/show_bug.cgi?id=105086
fdo#100368 https://bugs.freedesktop.org/show_bug.cgi?id=100368

fi-bdw-5557u     total:285  pass:264  dwarn:0   dfail:0   fail:0   skip:21  time:431s
fi-bdw-gvtdvm    total:285  pass:261  dwarn:0   dfail:0   fail:0   skip:24  time:445s
fi-blb-e6850     total:285  pass:220  dwarn:1   dfail:0   fail:0   skip:64  time:382s
fi-bsw-n3050     total:285  pass:239  dwarn:0   dfail:0   fail:0   skip:46  time:537s
fi-bwr-2160      total:285  pass:180  dwarn:0   dfail:0   fail:0   skip:105 time:297s
fi-bxt-dsi       total:285  pass:255  dwarn:0   dfail:0   fail:0   skip:30  time:516s
fi-bxt-j4205     total:285  pass:256  dwarn:0   dfail:0   fail:0   skip:29  time:512s
fi-byt-j1900     total:285  pass:250  dwarn:0   dfail:0   fail:0   skip:35  time:522s
fi-byt-n2820     total:285  pass:246  dwarn:0   dfail:0   fail:0   skip:39  time:515s
fi-cfl-8700k     total:285  pass:257  dwarn:0   dfail:0   fail:0   skip:28  time:410s
fi-cfl-s3        total:285  pass:259  dwarn:0   dfail:0   fail:0   skip:26  time:556s
fi-cfl-u         total:285  pass:259  dwarn:0   dfail:0   fail:0   skip:26  time:513s
fi-cnl-y3        total:285  pass:259  dwarn:0   dfail:0   fail:0   skip:26  time:583s
fi-elk-e7500     total:285  pass:226  dwarn:0   dfail:0   fail:0   skip:59  time:424s
fi-gdg-551       total:285  pass:176  dwarn:0   dfail:0   fail:1   skip:108 time:317s
fi-glk-1         total:285  pass:257  dwarn:0   dfail:0   fail:0   skip:28  time:539s
fi-glk-j4005     total:285  pass:256  dwarn:0   dfail:0   fail:0   skip:29  time:487s
fi-hsw-4770      total:285  pass:258  dwarn:0   dfail:0   fail:0   skip:27  time:406s
fi-ilk-650       total:285  pass:225  dwarn:0   dfail:0   fail:0   skip:60  time:420s
fi-ivb-3520m     total:285  pass:256  dwarn:0   dfail:0   fail:0   skip:29  time:471s
fi-ivb-3770      total:285  pass:252  dwarn:0   dfail:0   fail:0   skip:33  time:443s
fi-kbl-7500u     total:285  pass:259  dwarn:1   dfail:0   fail:1   skip:24  time:472s
fi-kbl-7567u     total:285  pass:265  dwarn:0   dfail:0   fail:0   skip:20  time:465s
fi-kbl-r         total:285  pass:258  dwarn:0   dfail:0   fail:0   skip:27  time:510s
fi-pnv-d510      total:285  pass:220  dwarn:1   dfail:0   fail:0   skip:64  time:668s
fi-skl-6260u     total:285  pass:265  dwarn:0   dfail:0   fail:0   skip:20  time:442s
fi-skl-6600u     total:285  pass:258  dwarn:0   dfail:0   fail:0   skip:27  time:542s
fi-skl-6700k2    total:285  pass:261  dwarn:0   dfail:0   fail:0   skip:24  time:506s
fi-skl-6770hq    total:285  pass:265  dwarn:0   dfail:0   fail:0   skip:20  time:524s
fi-skl-guc       total:285  pass:257  dwarn:0   dfail:0   fail:0   skip:28  time:430s
fi-skl-gvtdvm    total:285  pass:262  dwarn:0   dfail:0   fail:0   skip:23  time:446s
fi-snb-2520m     total:242  pass:208  dwarn:0   dfail:0   fail:0   skip:33 
fi-snb-2600      total:285  pass:245  dwarn:0   dfail:0   fail:0   skip:40  time:411s

1be073153147c5c39cdcbdfdeb4e2595ba595bf7 drm-tip: 2018y-04m-07d-22h-26m-31s UTC integration manifest
2b0b45f4d71b drm/i915: Do not do fb src adjustments for NV12
44ac80695da4 drm/i915: Reuse code from check_sprite for primary as well
5e0cebc97566 drm/i915: Add NV12 support to intel_framebuffer_init
2f4d177b68b5 drm/i915: Add NV12 as supported format for sprite plane
0be7b82fdf88 drm/i915: Add NV12 as supported format for primary plane
99c0d581d3c5 drm/i915: Upscale scaler max scale for NV12
ef7524234bd8 drm/i915: Update format_is_yuv() to include NV12
01eb2024a5fb drm/i915: Set scaler mode for NV12
ed78db97667e drm/i915: Enable YUV to RGB for Gen10 in Plane Ctrl Reg
999d94c9fc84 drm/i915: Display WA 827
f112cdd0184a drm/i915/skl: split skl_compute_ddb function
84cd7a4e7cc3 drm/i915/skl+: nv12 workaround disable WM level 1-7
31008b8a438d drm/i915/skl+: make sure higher latency level has higher wm value
900b7d59fc98 drm/i915/skl+: pass skl_wm_level struct to wm compute func
c777a027f525 drm/i915/skl+: NV12 related changes for WM
a115cc1faebf drm/i915/skl+: support verification of DDB HW state for NV12
7f1070f7c827 drm/i915/skl+: add NV12 in skl_format_to_fourcc
12aaf60e344d drm/i915/skl+: refactor WM calculation for NV12
1a47c2723387 drm/i915/skl+: rename skl_wm_values struct to skl_ddb_values
---- Possible new issues:

Test gem_pwrite:
        Subgroup big-gtt-backwards:
                skip       -> PASS       (shard-apl)
Test kms_cursor_crc:
        Subgroup cursor-128x128-suspend:
                pass       -> FAIL       (shard-apl)
Test kms_plane_scaling:
        Subgroup pipe-a-scaler-with-clipping-clamping:
                pass       -> DMESG-WARN (shard-apl)
        Subgroup pipe-b-scaler-with-clipping-clamping:
                pass       -> DMESG-WARN (shard-apl)
Test kms_universal_plane:
        Subgroup universal-plane-pipe-a-sanity:
                pass       -> DMESG-WARN (shard-hsw)
        Subgroup universal-plane-pipe-b-sanity:
                pass       -> DMESG-WARN (shard-hsw)
        Subgroup universal-plane-pipe-c-sanity:
                pass       -> DMESG-WARN (shard-hsw)

---- Known issues:

Test drv_selftest:
        Subgroup live_gtt:
                pass       -> FAIL       (shard-apl) fdo#103927
Test kms_flip:
        Subgroup 2x-flip-vs-expired-vblank-interruptible:
                fail       -> PASS       (shard-hsw) fdo#102887
        Subgroup 2x-plain-flip-fb-recreate:
                fail       -> PASS       (shard-hsw) fdo#100368
Test kms_flip_tiling:
        Subgroup flip-to-x-tiled:
                pass       -> FAIL       (shard-apl) fdo#103822
Test kms_frontbuffer_tracking:
        Subgroup fbc-1p-primscrn-pri-indfb-draw-mmap-wc:
                pass       -> FAIL       (shard-apl) fdo#103167

fdo#103927 https://bugs.freedesktop.org/show_bug.cgi?id=103927
fdo#102887 https://bugs.freedesktop.org/show_bug.cgi?id=102887
fdo#100368 https://bugs.freedesktop.org/show_bug.cgi?id=100368
fdo#103822 https://bugs.freedesktop.org/show_bug.cgi?id=103822
fdo#103167 https://bugs.freedesktop.org/show_bug.cgi?id=103167

shard-apl        total:2680 pass:1830 dwarn:3   dfail:0   fail:11  skip:836 time:12631s
shard-hsw        total:2680 pass:1783 dwarn:4   dfail:0   fail:1   skip:891 time:11320s
Blacklisted hosts:
shard-kbl        total:2680 pass:1925 dwarn:34  dfail:0   fail:11  skip:710 time:9118s
shard-snb        total:2680 pass:1374 dwarn:3   dfail:0   fail:4   skip:1299 time:6953s