Series without cover letter

Submitted by Ben Widawsky on March 24, 2017, 9:29 p.m.

Details

Reviewer None
Submitted March 24, 2017, 9:29 p.m.
Last Updated April 3, 2017, 9:23 p.m.
Revision 3

Revisions

Patches download mbox

Tests

Series 21854v1 Series without cover letter
https://patchwork.freedesktop.org/api/1.0/series/21854/revisions/1/mbox/

Test gem_exec_flush:
        Subgroup basic-batch-kernel-default-uc:
                fail       -> PASS       (fi-snb-2600) fdo#100007

fdo#100007 https://bugs.freedesktop.org/show_bug.cgi?id=100007

fi-bdw-5557u     total:278  pass:262  dwarn:0   dfail:0   fail:5   skip:11  time: 466s
fi-bdw-gvtdvm    total:278  pass:251  dwarn:8   dfail:0   fail:5   skip:14  time: 453s
fi-bsw-n3050     total:278  pass:234  dwarn:0   dfail:0   fail:5   skip:39  time: 592s
fi-bxt-j4205     total:278  pass:254  dwarn:0   dfail:0   fail:5   skip:19  time: 539s
fi-bxt-t5700     total:278  pass:253  dwarn:0   dfail:0   fail:5   skip:20  time: 564s
fi-byt-j1900     total:278  pass:246  dwarn:0   dfail:0   fail:5   skip:27  time: 510s
fi-byt-n2820     total:278  pass:242  dwarn:0   dfail:0   fail:5   skip:31  time: 504s
fi-hsw-4770      total:278  pass:257  dwarn:0   dfail:0   fail:5   skip:16  time: 438s
fi-hsw-4770r     total:278  pass:257  dwarn:0   dfail:0   fail:5   skip:16  time: 432s
fi-ilk-650       total:278  pass:223  dwarn:0   dfail:0   fail:5   skip:50  time: 447s
fi-ivb-3520m     total:278  pass:255  dwarn:0   dfail:0   fail:5   skip:18  time: 516s
fi-ivb-3770      total:278  pass:255  dwarn:0   dfail:0   fail:5   skip:18  time: 503s
fi-kbl-7500u     total:278  pass:255  dwarn:0   dfail:0   fail:5   skip:18  time: 481s
fi-skl-6260u     total:278  pass:263  dwarn:0   dfail:0   fail:5   skip:10  time: 486s
fi-skl-6700hq    total:278  pass:255  dwarn:0   dfail:0   fail:5   skip:18  time: 608s
fi-skl-6700k     total:278  pass:251  dwarn:4   dfail:0   fail:5   skip:18  time: 480s
fi-skl-6770hq    total:278  pass:263  dwarn:0   dfail:0   fail:5   skip:10  time: 517s
fi-skl-gvtdvm    total:278  pass:260  dwarn:0   dfail:0   fail:5   skip:13  time: 461s
fi-snb-2520m     total:278  pass:245  dwarn:0   dfail:0   fail:5   skip:28  time: 552s
fi-snb-2600      total:278  pass:244  dwarn:0   dfail:0   fail:5   skip:29  time: 424s

36ae70c6a67b894a97ba4098a32e091334ef51bc drm-tip: 2017y-03m-24d-19h-36m-19s UTC integration manifest
816a758 drm/i915: Add format modifiers for Intel
e906273 drm: Add new DRM_IOCTL_MODE_GETPLANE2
45b6fd7 drm/i915: Use LINEAR modifier instead of NONE
SERIES REVISION LOOKS STRANGE. Please double-check patch list and the ordering before proceeding.

Patches download mbox

Tests

Series 21854v2 Series without cover letter
https://patchwork.freedesktop.org/api/1.0/series/21854/revisions/2/mbox/

Test gem_exec_suspend:
        Subgroup basic-s4-devices:
                dmesg-warn -> PASS       (fi-kbl-7560u) fdo#100125

fdo#100125 https://bugs.freedesktop.org/show_bug.cgi?id=100125

fi-bdw-5557u     total:278  pass:267  dwarn:0   dfail:0   fail:0   skip:11  time: 430s
fi-bdw-gvtdvm    total:278  pass:256  dwarn:8   dfail:0   fail:0   skip:14  time: 424s
fi-bsw-n3050     total:278  pass:239  dwarn:0   dfail:0   fail:0   skip:39  time: 564s
fi-bxt-j4205     total:278  pass:259  dwarn:0   dfail:0   fail:0   skip:19  time: 508s
fi-bxt-t5700     total:278  pass:258  dwarn:0   dfail:0   fail:0   skip:20  time: 550s
fi-byt-j1900     total:278  pass:251  dwarn:0   dfail:0   fail:0   skip:27  time: 484s
fi-byt-n2820     total:278  pass:247  dwarn:0   dfail:0   fail:0   skip:31  time: 482s
fi-hsw-4770      total:278  pass:262  dwarn:0   dfail:0   fail:0   skip:16  time: 412s
fi-hsw-4770r     total:278  pass:262  dwarn:0   dfail:0   fail:0   skip:16  time: 410s
fi-ilk-650       total:278  pass:228  dwarn:0   dfail:0   fail:0   skip:50  time: 421s
fi-ivb-3520m     total:278  pass:260  dwarn:0   dfail:0   fail:0   skip:18  time: 481s
fi-ivb-3770      total:278  pass:260  dwarn:0   dfail:0   fail:0   skip:18  time: 467s
fi-kbl-7500u     total:278  pass:260  dwarn:0   dfail:0   fail:0   skip:18  time: 453s
fi-kbl-7560u     total:278  pass:268  dwarn:0   dfail:0   fail:0   skip:10  time: 565s
fi-skl-6260u     total:278  pass:268  dwarn:0   dfail:0   fail:0   skip:10  time: 457s
fi-skl-6700hq    total:278  pass:261  dwarn:0   dfail:0   fail:0   skip:17  time: 574s
fi-skl-6700k     total:278  pass:256  dwarn:4   dfail:0   fail:0   skip:18  time: 463s
fi-skl-6770hq    total:278  pass:268  dwarn:0   dfail:0   fail:0   skip:10  time: 491s
fi-skl-gvtdvm    total:278  pass:265  dwarn:0   dfail:0   fail:0   skip:13  time: 432s
fi-snb-2520m     total:278  pass:250  dwarn:0   dfail:0   fail:0   skip:28  time: 528s
fi-snb-2600      total:278  pass:249  dwarn:0   dfail:0   fail:0   skip:29  time: 403s

a544b108466ecc1d3819b735f7c35f7f8c071b9a drm-tip: 2017y-03m-31d-14h-34m-10s UTC integration manifest
6ed3e31 drm: Add new DRM_IOCTL_MODE_GETPLANE2

Patches download mbox

Tests

  LD      drivers/acpi/acpica/built-in.o
  CC [M]  drivers/gpu/drm/i915/gvt/execlist.o
  CC [M]  drivers/gpu/drm/i915/gvt/scheduler.o
  LD      lib/raid6/built-in.o
  CC [M]  drivers/gpu/drm/i915/gvt/sched_policy.o
  CC [M]  drivers/gpu/drm/i915/gvt/render.o
  CC [M]  drivers/gpu/drm/i915/gvt/cmd_parser.o
  CC [M]  drivers/gpu/drm/i915/intel_lpe_audio.o
  LD      drivers/pci/pcie/aer/aerdriver.o
  LD      drivers/pci/pcie/aer/built-in.o
  LD      drivers/pci/pcie/built-in.o
  LD [M]  drivers/usb/serial/usbserial.o
  LD      drivers/acpi/built-in.o
  LD [M]  sound/pci/hda/snd-hda-codec-realtek.o
  LD [M]  sound/pci/hda/snd-hda-codec-hdmi.o
  LD      drivers/spi/built-in.o
  LD      drivers/scsi/scsi_mod.o
  LD      drivers/pci/built-in.o
  LD      net/packet/built-in.o
  LD      drivers/video/fbdev/core/fb.o
  LD      drivers/video/fbdev/core/built-in.o
  LD      drivers/iommu/built-in.o
  LD [M]  drivers/gpu/drm/vgem/vgem.o
  LD      drivers/usb/storage/usb-storage.o
  LD      drivers/usb/storage/built-in.o
  LD      drivers/video/fbdev/built-in.o
  LD      drivers/usb/gadget/libcomposite.o
  LD [M]  drivers/net/ethernet/intel/e1000/e1000.o
  LD      lib/lz4/built-in.o
  LD      drivers/scsi/sd_mod.o
  LD      drivers/scsi/built-in.o
  LD      kernel/sched/built-in.o
  LD [M]  drivers/net/ethernet/intel/igbvf/igbvf.o
  LD      kernel/built-in.o
  LD      drivers/tty/serial/8250/8250_base.o
  LD      drivers/tty/serial/8250/built-in.o
  LD      drivers/tty/serial/built-in.o
  LD      net/xfrm/built-in.o
  LD      drivers/usb/gadget/udc/udc-core.o
  LD      drivers/usb/gadget/udc/built-in.o
  LD      drivers/usb/gadget/built-in.o
drivers/gpu/drm/i915/intel_display.c: In function ‘intel_primary_plane_create’:
drivers/gpu/drm/i915/intel_display.c:13746:1: error: expected expression before ‘<<’ token
 <<<<<<< f09b91b0901f5fd3fabeb887a6fd38b0dafd1474
 ^
drivers/gpu/drm/i915/intel_display.c:13753:27: error: ‘ironlake_update_primary_plane’ undeclared (first use in this function)
   primary->update_plane = ironlake_update_primary_plane;
                           ^
drivers/gpu/drm/i915/intel_display.c:13753:27: note: each undeclared identifier is reported only once for each function it appears in
drivers/gpu/drm/i915/intel_display.c:13755:1: error: expected expression before ‘>>’ token
 >>>>>>> drm/i915: Add format modifiers for Intel
 ^
  LD      drivers/gpu/drm/drm.o
  LD      drivers/video/console/built-in.o
  LD      drivers/video/built-in.o
  LD      net/ipv6/ipv6.o
  AR      lib/lib.a
scripts/Makefile.build:294: recipe for target 'drivers/gpu/drm/i915/intel_display.o' failed
make[4]: *** [drivers/gpu/drm/i915/intel_display.o] Error 1
make[4]: *** Waiting for unfinished jobs....
  EXPORTS lib/lib-ksyms.o
  LD      net/ipv6/built-in.o
  LD      lib/built-in.o
  LD      fs/btrfs/btrfs.o
  LD      drivers/usb/core/usbcore.o
  LD      drivers/usb/core/built-in.o
  LD      drivers/md/md-mod.o
  LD      drivers/md/built-in.o
  LD      fs/btrfs/built-in.o
  LD      drivers/tty/vt/built-in.o
  LD      drivers/tty/built-in.o
  LD [M]  sound/pci/hda/snd-hda-codec-generic.o
  LD      sound/pci/built-in.o
  LD      sound/built-in.o
  CC      arch/x86/kernel/cpu/capflags.o
  LD      arch/x86/kernel/cpu/built-in.o
  LD      arch/x86/kernel/built-in.o
  LD      arch/x86/built-in.o
  LD [M]  drivers/net/ethernet/intel/igb/igb.o
  LD      net/ipv4/built-in.o
  LD      drivers/usb/host/xhci-hcd.o
  LD      fs/ext4/ext4.o
  LD      fs/ext4/built-in.o
  LD      drivers/usb/host/built-in.o
  LD      fs/built-in.o
  LD      drivers/usb/built-in.o
  LD [M]  drivers/net/ethernet/intel/e1000e/e1000e.o
  LD      net/core/built-in.o
  LD      net/built-in.o
scripts/Makefile.build:553: recipe for target 'drivers/gpu/drm/i915' failed
make[3]: *** [drivers/gpu/drm/i915] Error 2
scripts/Makefile.build:553: recipe for target 'drivers/gpu/drm' failed
make[2]: *** [drivers/gpu/drm] Error 2
scripts/Makefile.build:553: recipe for target 'drivers/gpu' failed
make[1]: *** [drivers/gpu] Error 2
make[1]: *** Waiting for unfinished jobs....
  LD      drivers/net/ethernet/built-in.o
  LD      drivers/net/built-in.o
Makefile:1002: recipe for target 'drivers' failed
make: *** [drivers] Error 2