Series without cover letter

Submitted by Chris Wilson on Feb. 28, 2017, 9:37 a.m.

Details

Reviewer None
Submitted Feb. 28, 2017, 9:37 a.m.
Last Updated Feb. 28, 2017, 10:32 p.m.
Revision 1

Revisions

Patches download mbox

Tests

  AR      lib/lib.a
  EXPORTS lib/lib-ksyms.o
  LD [M]  drivers/misc/mei/mei-me.o
  LD      kernel/sched/built-in.o
  LD      drivers/misc/built-in.o
  LD [M]  drivers/net/ethernet/broadcom/genet/genet.o
  LD [M]  drivers/mmc/core/mmc_block.o
  LD      drivers/acpi/acpica/built-in.o
  LD      drivers/mmc/built-in.o
  LD      kernel/built-in.o
  LD      lib/built-in.o
  LD      drivers/video/fbdev/core/fb.o
  LD      drivers/video/fbdev/core/built-in.o
  LD [M]  drivers/usb/serial/usbserial.o
  LD      drivers/acpi/built-in.o
  LD      drivers/thermal/thermal_sys.o
  LD      drivers/thermal/built-in.o
  LD [M]  drivers/gpu/drm/vgem/vgem.o
  LD      net/ipv6/ipv6.o
  LD      drivers/tty/serial/8250/8250.o
  LD [M]  sound/pci/hda/snd-hda-codec-generic.o
  LD      drivers/video/fbdev/built-in.o
  LD      sound/pci/built-in.o
  LD      net/ipv6/built-in.o
drivers/gpu/drm/i915/i915_guc_submission.c:366:1: error: expected identifier or ‘(’ before ‘<<’ token
 <<<<<<< e376ca1b97525891e25650faf755e27a74309ed2
 ^
drivers/gpu/drm/i915/i915_guc_submission.c:140:13: error: ‘guc_disable_doorbell’ defined but not used [-Werror=unused-function]
 static void guc_disable_doorbell(struct intel_guc *guc,
             ^
drivers/gpu/drm/i915/i915_guc_submission.c:150:1: error: ‘select_doorbell_register’ defined but not used [-Werror=unused-function]
 select_doorbell_register(struct intel_guc *guc, uint32_t priority)
 ^
drivers/gpu/drm/i915/i915_guc_submission.c:182:17: error: ‘select_doorbell_cacheline’ defined but not used [-Werror=unused-function]
 static uint32_t select_doorbell_cacheline(struct intel_guc *guc)
                 ^
drivers/gpu/drm/i915/i915_guc_submission.c:202:13: error: ‘guc_proc_desc_init’ defined but not used [-Werror=unused-function]
 static void guc_proc_desc_init(struct intel_guc *guc,
             ^
drivers/gpu/drm/i915/i915_guc_submission.c:234:13: error: ‘guc_ctx_desc_init’ defined but not used [-Werror=unused-function]
 static void guc_ctx_desc_init(struct intel_guc *guc,
             ^
drivers/gpu/drm/i915/i915_guc_submission.c:313:13: error: ‘guc_ctx_desc_fini’ defined but not used [-Werror=unused-function]
 static void guc_ctx_desc_fini(struct intel_guc *guc,
             ^
cc1: all warnings being treated as errors
  LD      sound/built-in.o
scripts/Makefile.build:294: recipe for target 'drivers/gpu/drm/i915/i915_guc_submission.o' failed
make[4]: *** [drivers/gpu/drm/i915/i915_guc_submission.o] Error 1
make[4]: *** Waiting for unfinished jobs....
  LD [M]  drivers/net/ethernet/intel/igbvf/igbvf.o
  LD      drivers/scsi/scsi_mod.o
  LD      net/xfrm/built-in.o
  LD      drivers/usb/gadget/udc/udc-core.o
  LD      drivers/usb/gadget/udc/built-in.o
  LD      drivers/gpu/drm/drm.o
  LD      drivers/spi/built-in.o
  LD [M]  drivers/net/ethernet/intel/e1000/e1000.o
  LD      net/ipv4/built-in.o
  LD      drivers/tty/serial/8250/8250_base.o
  LD      drivers/tty/serial/8250/built-in.o
  LD      drivers/usb/gadget/libcomposite.o
  LD      drivers/usb/gadget/built-in.o
  LD      drivers/scsi/sd_mod.o
  LD      drivers/scsi/built-in.o
  LD      drivers/tty/serial/built-in.o
  LD      fs/btrfs/btrfs.o
  LD      fs/btrfs/built-in.o
  LD      drivers/usb/core/usbcore.o
  LD      drivers/usb/core/built-in.o
  LD      drivers/video/console/built-in.o
  LD      drivers/video/built-in.o
  LD      drivers/md/md-mod.o
  LD      drivers/md/built-in.o
  CC      arch/x86/kernel/cpu/capflags.o
  LD      arch/x86/kernel/cpu/built-in.o
  LD      net/core/built-in.o
  LD      arch/x86/kernel/built-in.o
  LD      drivers/tty/vt/built-in.o
  LD      drivers/tty/built-in.o
  LD      net/built-in.o
  LD      arch/x86/built-in.o
  LD      drivers/usb/host/xhci-hcd.o
  LD      fs/ext4/ext4.o
  LD [M]  drivers/net/ethernet/intel/igb/igb.o
  LD      fs/ext4/built-in.o
  LD      fs/built-in.o
  LD      drivers/usb/host/built-in.o
  LD      drivers/usb/built-in.o
  LD [M]  drivers/net/ethernet/intel/e1000e/e1000e.o
  LD      drivers/net/ethernet/built-in.o
  LD      drivers/net/built-in.o
scripts/Makefile.build:553: recipe for target 'drivers/gpu/drm/i915' failed
make[3]: *** [drivers/gpu/drm/i915] Error 2
scripts/Makefile.build:553: recipe for target 'drivers/gpu/drm' failed
make[2]: *** [drivers/gpu/drm] Error 2
scripts/Makefile.build:553: recipe for target 'drivers/gpu' failed
make[1]: *** [drivers/gpu] Error 2
Makefile:990: recipe for target 'drivers' failed
make: *** [drivers] Error 2